{"text_format":"1","workbook":"xlsx","n_sheets":9,"sheets":["Instructions","Input","HVA","Incident Log","Summary","Detail","Calculation","Reference","Template"],"not_rendered":{"charts":1,"images":1,"macros":1,"external_links":0,"defined_names":22,"comments":0,"pivot_tables":0},"unopened":[],"bounds":{"document_bytes":16777216,"sheet_cells":100000,"rows_first":2000,"rows_last":500,"rows_between":2000,"halvings":0,"cell_chars":16384,"cell_head_chars":4096},"cells_cut":0,"cells_raw":0,"read":"whole","date_system":"1900"}

{"sheet":"Instructions","index":0,"n_rows":30,"n_cols":10,"rows_kept":30,"cut":false,"hidden":false,"merged":[[9,9,9,14],[3,0,3,14],[0,0,0,14],[2,0,2,14],[4,0,4,6],[4,8,4,14],[5,1,5,6],[5,9,5,14],[1,0,1,14],[6,1,6,6],[6,9,6,14],[7,9,7,14],[8,0,8,6],[8,9,8,14]]}
[]
["INSTRUCTIONS FOR COMPLETING THE HAZARD VULNERABILITY ANALYSIS (HVA)"]
["This HVA tool is a living document.  Facilities using the tool shall complete it as it pertains to their facility / building. \n1) Following this tab listing Instructions for the completion of the HVA, is a tab listed as Input. \n     a) List the year when this HVA is being completed in Cell B11.  The template will indicate: \"YEAR\" in B11\n     b) List the facility name and address next to \"Report For\" in Cell B14.  The template will indicate: \"SITE & ADDRESS\" in B14\n     c) Information entered into the Input tab will be directly populated into the HVA under the HVA tab.\n2) The HVA tab contains various \"Alert Type\".  Review them and assign each with Probability Rating between 0 -3.  Review the information in the section below titled: Considerations for Completing the HVA.  Other factors are to consider each event incident occuring at the worst possible time (i.e. during peak patient loads, etc.).\n    a) Do not enter a value for each \"Alert Type\" under the columns titled: \"Alerts\" and \"Activations\".  These are self populated cells.\n    b) Review the considerations in the table below and assign each \"Alert Typle\" in the HVA with a rating for HUMAN, PROPERTY and BUSINESS IMPACTS\n    c) Review the considerations in the table below and assign each \"Alert Typle\" in the HVA with a rating for PREPAREDNESS, INTERNAL and EXTERNAL RESPONSES\n    d) Once the values are entered a percentage value will be automatically assigned under the \"Risk\" column.  \n3) Once the \"Risk\" percentages are established, the facility must then identify its top 3 - 5 risks.  An Emergency Operations Plan focusing on: Mitigation, Preparedness, Response, and Recovery should be developed to focus on these vulnerabilities. \n4) As noted, this HVA tool is a living document. As they occur throughout the calendar year incidents that align with the \"Alert Type\" on the HVA should be cataloged on the sheet under the tab titled: \"Incident Log\". A number of the cells in each column provide the user options to choose a response, which are then tabulated on the HVA based on the incident.  If the Incident is deemed as \"Alerts\" or \"Activations\"  their tally will be captured and the HVA \"Risk\" percentage for that \"Alert Type\" will be recalculated.  \n5) The \"Summary\" captures and tabulates the events entered on the Incident Log tab, which aids in the development of the Annual Review write-up of the Emergency Management Plan."]
["CONSIDERATIONS FOR COMPLETING THE HVA"]
["PROBABILITY: Issues to consider include, but are not limited to:",null,null,null,null,null,null,null,"PREPAREDNESS: Issues to consider include, but are not limited to:"]
["Ø","Known Risk",null,null,null,null,null,null,"Ø","Status of current plans"]
["Ø","Historical Data (10 Year Time Frame)",null,null,null,null,null,null,"Ø","Frequency of drills"]
[null,null,null,null,null,null,null,null,"Ø","Training and implementation status"]
["HUMAN IMPACT: Issues to consider include, but are not limited to:",null,null,null,null,null,null,null,"Ø","Insurance"]
["Ø","Acuity and volume of injury/death to staff, patients, & visitors",null,null,null,null,null,null,"Ø","Availability of alternate sources for critical supplies/services"]
[]
["PROPERTY IMPACT: Issues to consider include, but are not limited to:",null,null,null,null,null,null,null,"INTERNAL RESPONSE: Issues to consider include, but are not limited to:"]
["Ø","Cost to replace",null,null,null,null,null,null,"Ø","Types of supplies on hand/will they meet need?"]
["Ø","Cost to set up temporary replacement",null,null,null,null,null,null,"Ø","Volume of supplies on hand/will they meet need?"]
["Ø","Cost to repair",null,null,null,null,null,null,"Ø","Staff availability"]
["Ø","Time to recover",null,null,null,null,null,null,"Ø","Coordination with Memorandums of Understanding"]
["Ø","Cost to repair/replace based on past incidents",null,null,null,null,null,null,"Ø","Availability of back-up systems"]
[null,null,null,null,null,null,null,null,"Ø","Internal resources ability to withstand disasters/survivability"]
["BUSINESS IMPACT: Issues to consider include, but are not limited to:"]
["Ø","Business interruption",null,null,null,null,null,null,"EXTERNAL RESPONSE: Issues to consider include, but are not limited to:"]
["Ø","Employees unable to report to work",null,null,null,null,null,null,"Ø","Types of agreements with community agencies/drills"]
["Ø","Members unable to reach facility",null,null,null,null,null,null,"Ø","Coordination with local and state agencies"]
["Ø","Company in violation of contractual agreements",null,null,null,null,null,null,"Ø","Coordination with proximal health care facilities"]
["Ø","Imposition of fines and penalties or legal costs",null,null,null,null,null,null,"Ø","Coordination with treatment specific facilities"]
["Ø","Interruption of critical supplies",null,null,null,null,null,null,"Ø","Community resources"]
["Ø","Interruption of product distribution",null,null,null,null,null,null,"Ø","Time to marshall an on-scene response"]
["Ø","Reputation and public image",null,null,null,null,null,null,"Ø","Scope of response capability"]
["Ø","Financial impact/burden",null,null,null,null,null,null,"Ø","Historical evaluation of response success"]
["Ø","Loss of business",null,null,null,null,null,null,"Ø","Local emergency response availability"]
["Ø","Revenue lost during past incidents"]

{"sheet":"Input","index":1,"n_rows":17,"n_cols":2,"rows_kept":17,"cut":false,"hidden":false,"merged":[]}
[]
[]
[]
[]
[]
["Input"]
[]
[]
[]
[]
["Report Year","YEAR"]
["Last Saved","Tuesday, July 16, 2024 at 10:00 AM"]
[]
["Report For","SITE & ADDRESS"]
[]
["Max Score",5]
["Max Total Score",18]

{"sheet":"HVA","index":2,"n_rows":75,"n_cols":15,"rows_kept":75,"cut":false,"hidden":false,"merged":[[9,4,9,9],[9,0,11,0]]}
[]
[]
[]
[]
[]
[{"$f":"\"Hazards - \"&Input!B14","v":"Hazards - SITE & ADDRESS"}]
["Hazard Vulnerability Assessment Tool"]
[]
[]
["Alert Type"," ",null,null,"SEVERITY = ( MAGNITUDE - MITGATION )"]
[null,"PROBABILITY","ALERTS","ACTIVATIONS","HUMAN\nIMPACT","PROPERTY\nIMPACT","BUSINESS\nIMPACT","PREPARED-\nNESS","INTERNAL\nRESPONSE","EXTERNAL\nRESPONSE","RISK","MAX SCORE"]
[null,"Likelihood this will occur",null,null,"Possibility of dealth or injury","Physical losses and damages","Interuption of services","Preplanning","Time, effectiveness, resources","Community/Mutual Aid staff and supplies","* Relative threat"]
["SCORE","0 = N/A\n1 = Low\n2 = Moderate\n3 = High",{"$f":"\"Number of Alerts\"","v":"Number of Alerts"},{"$f":"\"Number of Activations\"","v":"Number of Activations"},"0 = N/A\n1 = Low\n2 = Moderate\n3 = High","0 = N/A\n1 = Low\n2 = Moderate\n3 = High","0 = N/A\n1 = Low\n2 = Moderate\n3 = High","0 = N/A\n1 = High\n2 = Moderate\n3 = Low","0 = N/A\n1 = High\n2 = Moderate\n3 = Low","0 = N/A\n1 =High\n2 = Moderate\n3 = Low","0 - 100%","Probability + 'Total Alerts + Total Activations",null,"Rank","Alert Type"]
[{"$f":"IF(Reference!A9=\"\",\"\",Reference!A9)","v":"Active Shooter"},null,{"$f":"IF(B14=\"\",\"\",COUNTIF('Incident Log'!$C$11:$C$500,A14))","v":""},{"$f":"IF(B14=\"\",\"\",COUNTIFS('Incident Log'!$C$11:$C$500,\"=\"&A14,'Incident Log'!$J$11:$J$500,\"=Yes\"))","v":""},null,null,null,null,null,null,{"$f":"IF(B14=\"\",\"\",ROUND(SUM(B14:D14)/L14*SUM(E14:J14)/MaxTotalScore,13))","v":""},{"$f":"IF(B14=\"\",\"\",SUM(C14:D14)+MaxScore)","v":""},null,{"$f":"IF(K14=\"\",\"\",RANK(K14,$K$14:$K$500)+COUNTIF(K14:$K$14,K14)-1)","v":""},{"$f":"A14","v":"Active Shooter"}]
[{"$f":"IF(Reference!A10=\"\",\"\",Reference!A10)","v":"Act of Terrorism"},null,{"$f":"IF(B15=\"\",\"\",COUNTIF('Incident Log'!$C$11:$C$500,A15))","v":""},{"$f":"IF(B15=\"\",\"\",COUNTIFS('Incident Log'!$C$11:$C$500,\"=\"&A15,'Incident Log'!$J$11:$J$500,\"=Yes\"))","v":""},null,null,null,null,null,null,"","",null,{"$f":"IF(K15=\"\",\"\",RANK(K15,$K$14:$K$500)+COUNTIF(K$14:$K15,K15)-1)","v":""},{"$f":"A15","v":"Act of Terrorism"}]
[{"$f":"IF(Reference!A11=\"\",\"\",Reference!A11)","v":"Air Quality Issue"},null,{"$f":"IF(B16=\"\",\"\",COUNTIF('Incident Log'!$C$11:$C$500,A16))","v":""},{"$f":"IF(B16=\"\",\"\",COUNTIFS('Incident Log'!$C$11:$C$500,\"=\"&A16,'Incident Log'!$J$11:$J$500,\"=Yes\"))","v":""},null,null,null,null,null,null,"","",null,{"$f":"IF(K16=\"\",\"\",RANK(K16,$K$14:$K$500)+COUNTIF(K$14:$K16,K16)-1)","v":""},"Air Quality Issue"]
[{"$f":"IF(Reference!A12=\"\",\"\",Reference!A12)","v":"Bomb Threat"},null,{"$f":"IF(B17=\"\",\"\",COUNTIF('Incident Log'!$C$11:$C$500,A17))","v":""},{"$f":"IF(B17=\"\",\"\",COUNTIFS('Incident Log'!$C$11:$C$500,\"=\"&A17,'Incident Log'!$J$11:$J$500,\"=Yes\"))","v":""},null,null,null,null,null,null,"","",null,{"$f":"IF(K17=\"\",\"\",RANK(K17,$K$14:$K$500)+COUNTIF(K$14:$K17,K17)-1)","v":""},"Bomb Threat"]
[{"$f":"IF(Reference!A13=\"\",\"\",Reference!A13)","v":"Building Move"},null,{"$f":"IF(B18=\"\",\"\",COUNTIF('Incident Log'!$C$11:$C$500,A18))","v":""},{"$f":"IF(B18=\"\",\"\",COUNTIFS('Incident Log'!$C$11:$C$500,\"=\"&A18,'Incident Log'!$J$11:$J$500,\"=Yes\"))","v":""},null,null,null,null,null,null,"","",null,{"$f":"IF(K18=\"\",\"\",RANK(K18,$K$14:$K$500)+COUNTIF(K$14:$K18,K18)-1)","v":""},"Building Move"]
[{"$f":"IF(Reference!A14=\"\",\"\",Reference!A14)","v":"Chemical Exposure, External"},null,{"$f":"IF(B19=\"\",\"\",COUNTIF('Incident Log'!$C$11:$C$500,A19))","v":""},{"$f":"IF(B19=\"\",\"\",COUNTIFS('Incident Log'!$C$11:$C$500,\"=\"&A19,'Incident Log'!$J$11:$J$500,\"=Yes\"))","v":""},null,null,null,null,null,null,"","",null,{"$f":"IF(K19=\"\",\"\",RANK(K19,$K$14:$K$500)+COUNTIF(K$14:$K19,K19)-1)","v":""},"Chemical Exposure, External"]
[{"$f":"IF(Reference!A15=\"\",\"\",Reference!A15)","v":"Chemical Exposure, Internal"},null,{"$f":"IF(B20=\"\",\"\",COUNTIF('Incident Log'!$C$11:$C$500,A20))","v":""},{"$f":"IF(B20=\"\",\"\",COUNTIFS('Incident Log'!$C$11:$C$500,\"=\"&A20,'Incident Log'!$J$11:$J$500,\"=Yes\"))","v":""},null,null,null,null,null,null,"","",null,{"$f":"IF(K20=\"\",\"\",RANK(K20,$K$14:$K$500)+COUNTIF(K$14:$K20,K20)-1)","v":""},"Chemical Exposure, Internal"]
[{"$f":"IF(Reference!A16=\"\",\"\",Reference!A16)","v":"Chemical Spill"},null,{"$f":"IF(B21=\"\",\"\",COUNTIF('Incident Log'!$C$11:$C$500,A21))","v":""},{"$f":"IF(B21=\"\",\"\",COUNTIFS('Incident Log'!$C$11:$C$500,\"=\"&A21,'Incident Log'!$J$11:$J$500,\"=Yes\"))","v":""},null,null,null,null,null,null,"","",null,{"$f":"IF(K21=\"\",\"\",RANK(K21,$K$14:$K$500)+COUNTIF(K$14:$K21,K21)-1)","v":""},"Chemical Spill"]
[{"$f":"IF(Reference!A18=\"\",\"\",Reference!A18)","v":"Child Abduction"},null,{"$f":"IF(B22=\"\",\"\",COUNTIF('Incident Log'!$C$11:$C$500,A22))","v":""},{"$f":"IF(B22=\"\",\"\",COUNTIFS('Incident Log'!$C$11:$C$500,\"=\"&A22,'Incident Log'!$J$11:$J$500,\"=Yes\"))","v":""},null,null,null,null,null,null,"","",null,{"$f":"IF(K22=\"\",\"\",RANK(K22,$K$14:$K$500)+COUNTIF(K$14:$K22,K22)-1)","v":""},"Child Abduction"]
[{"$f":"IF(Reference!A19=\"\",\"\",Reference!A19)","v":"Civil Unrest / Protesting"},null,{"$f":"IF(B23=\"\",\"\",COUNTIF('Incident Log'!$C$11:$C$500,A23))","v":""},{"$f":"IF(B23=\"\",\"\",COUNTIFS('Incident Log'!$C$11:$C$500,\"=\"&A23,'Incident Log'!$J$11:$J$500,\"=Yes\"))","v":""},null,null,null,null,null,null,"","",null,{"$f":"IF(K23=\"\",\"\",RANK(K23,$K$14:$K$500)+COUNTIF(K$14:$K23,K23)-1)","v":""},"Civil Unrest / Protesting"]
[{"$f":"IF(Reference!A20=\"\",\"\",Reference!A20)","v":"Communication / Telephony Failure"},null,{"$f":"IF(B24=\"\",\"\",COUNTIF('Incident Log'!$C$11:$C$500,A24))","v":""},{"$f":"IF(B24=\"\",\"\",COUNTIFS('Incident Log'!$C$11:$C$500,\"=\"&A24,'Incident Log'!$J$11:$J$500,\"=Yes\"))","v":""},null,null,null,null,null,null,"","",null,{"$f":"IF(K24=\"\",\"\",RANK(K24,$K$14:$K$500)+COUNTIF(K$14:$K24,K24)-1)","v":""},"Communication / Telephony Failure"]
[{"$f":"IF(Reference!A21=\"\",\"\",Reference!A21)","v":"Dam Failure"},null,{"$f":"IF(B25=\"\",\"\",COUNTIF('Incident Log'!$C$11:$C$500,A25))","v":""},{"$f":"IF(B25=\"\",\"\",COUNTIFS('Incident Log'!$C$11:$C$500,\"=\"&A25,'Incident Log'!$J$11:$J$500,\"=Yes\"))","v":""},null,null,null,null,null,null,"","",null,{"$f":"IF(K25=\"\",\"\",RANK(K25,$K$14:$K$500)+COUNTIF(K$14:$K25,K25)-1)","v":""},"Dam Failure"]
[{"$f":"IF(Reference!A22=\"\",\"\",Reference!A22)","v":"Drought"},null,{"$f":"IF(B26=\"\",\"\",COUNTIF('Incident Log'!$C$11:$C$500,A26))","v":""},{"$f":"IF(B26=\"\",\"\",COUNTIFS('Incident Log'!$C$11:$C$500,\"=\"&A26,'Incident Log'!$J$11:$J$500,\"=Yes\"))","v":""},null,null,null,null,null,null,"","",null,{"$f":"IF(K26=\"\",\"\",RANK(K26,$K$14:$K$500)+COUNTIF(K$14:$K26,K26)-1)","v":""},"Drought"]
[{"$f":"IF(Reference!A23=\"\",\"\",Reference!A23)","v":"Earthquake"},null,{"$f":"IF(B27=\"\",\"\",COUNTIF('Incident Log'!$C$11:$C$500,A27))","v":""},{"$f":"IF(B27=\"\",\"\",COUNTIFS('Incident Log'!$C$11:$C$500,\"=\"&A27,'Incident Log'!$J$11:$J$500,\"=Yes\"))","v":""},null,null,null,null,null,null,"","",null,{"$f":"IF(K27=\"\",\"\",RANK(K27,$K$14:$K$500)+COUNTIF(K$14:$K27,K27)-1)","v":""},"Earthquake"]
[{"$f":"IF(Reference!A24=\"\",\"\",Reference!A24)","v":"Epidemic"},null,{"$f":"IF(B28=\"\",\"\",COUNTIF('Incident Log'!$C$11:$C$500,A28))","v":""},{"$f":"IF(B28=\"\",\"\",COUNTIFS('Incident Log'!$C$11:$C$500,\"=\"&A28,'Incident Log'!$J$11:$J$500,\"=Yes\"))","v":""},null,null,null,null,null,null,"","",null,{"$f":"IF(K28=\"\",\"\",RANK(K28,$K$14:$K$500)+COUNTIF(K$14:$K28,K28)-1)","v":""},"Epidemic"]
[{"$f":"IF(Reference!A25=\"\",\"\",Reference!A25)","v":"Evacuation"},null,{"$f":"IF(B29=\"\",\"\",COUNTIF('Incident Log'!$C$11:$C$500,A29))","v":""},{"$f":"IF(B29=\"\",\"\",COUNTIFS('Incident Log'!$C$11:$C$500,\"=\"&A29,'Incident Log'!$J$11:$J$500,\"=Yes\"))","v":""},null,null,null,null,null,null,"","",null,{"$f":"IF(K29=\"\",\"\",RANK(K29,$K$14:$K$500)+COUNTIF(K$14:$K29,K29)-1)","v":""},"Evacuation"]
[{"$f":"IF(Reference!A26=\"\",\"\",Reference!A26)","v":"Explosion"},null,{"$f":"IF(B30=\"\",\"\",COUNTIF('Incident Log'!$C$11:$C$500,A30))","v":""},{"$f":"IF(B30=\"\",\"\",COUNTIFS('Incident Log'!$C$11:$C$500,\"=\"&A30,'Incident Log'!$J$11:$J$500,\"=Yes\"))","v":""},null,null,null,null,null,null,"","",null,{"$f":"IF(K30=\"\",\"\",RANK(K30,$K$14:$K$500)+COUNTIF(K$14:$K30,K30)-1)","v":""},"Explosion"]
[{"$f":"IF(Reference!A27=\"\",\"\",Reference!A27)","v":"Fire, External"},null,{"$f":"IF(B31=\"\",\"\",COUNTIF('Incident Log'!$C$11:$C$500,A31))","v":""},{"$f":"IF(B31=\"\",\"\",COUNTIFS('Incident Log'!$C$11:$C$500,\"=\"&A31,'Incident Log'!$J$11:$J$500,\"=Yes\"))","v":""},null,null,null,null,null,null,"","",null,{"$f":"IF(K31=\"\",\"\",RANK(K31,$K$14:$K$500)+COUNTIF(K$14:$K31,K31)-1)","v":""},"Fire, External"]
[{"$f":"IF(Reference!A28=\"\",\"\",Reference!A28)","v":"Fire, Internal"},null,{"$f":"IF(B32=\"\",\"\",COUNTIF('Incident Log'!$C$11:$C$500,A32))","v":""},{"$f":"IF(B32=\"\",\"\",COUNTIFS('Incident Log'!$C$11:$C$500,\"=\"&A32,'Incident Log'!$J$11:$J$500,\"=Yes\"))","v":""},null,null,null,null,null,null,"","",null,{"$f":"IF(K32=\"\",\"\",RANK(K32,$K$14:$K$500)+COUNTIF(K$14:$K32,K32)-1)","v":""},"Fire, Internal"]
[{"$f":"IF(Reference!A29=\"\",\"\",Reference!A29)","v":"Flood, External"},null,{"$f":"IF(B33=\"\",\"\",COUNTIF('Incident Log'!$C$11:$C$500,A33))","v":""},{"$f":"IF(B33=\"\",\"\",COUNTIFS('Incident Log'!$C$11:$C$500,\"=\"&A33,'Incident Log'!$J$11:$J$500,\"=Yes\"))","v":""},null,null,null,null,null,null,"","",null,{"$f":"IF(K33=\"\",\"\",RANK(K33,$K$14:$K$500)+COUNTIF(K$14:$K33,K33)-1)","v":""},"Flood, External"]
[{"$f":"IF(Reference!A30=\"\",\"\",Reference!A30)","v":"Flood, Internal"},null,{"$f":"IF(B34=\"\",\"\",COUNTIF('Incident Log'!$C$11:$C$500,A34))","v":""},{"$f":"IF(B34=\"\",\"\",COUNTIFS('Incident Log'!$C$11:$C$500,\"=\"&A34,'Incident Log'!$J$11:$J$500,\"=Yes\"))","v":""},null,null,null,null,null,null,"","",null,{"$f":"IF(K34=\"\",\"\",RANK(K34,$K$14:$K$500)+COUNTIF(K$14:$K34,K34)-1)","v":""},"Flood, Internal"]
[{"$f":"IF(Reference!A31=\"\",\"\",Reference!A31)","v":"Forensic Admission"},null,{"$f":"IF(B35=\"\",\"\",COUNTIF('Incident Log'!$C$11:$C$500,A35))","v":""},{"$f":"IF(B35=\"\",\"\",COUNTIFS('Incident Log'!$C$11:$C$500,\"=\"&A35,'Incident Log'!$J$11:$J$500,\"=Yes\"))","v":""},null,null,null,null,null,null,"","",null,{"$f":"IF(K35=\"\",\"\",RANK(K35,$K$14:$K$500)+COUNTIF(K$14:$K35,K35)-1)","v":""},"Forensic Admission"]
[{"$f":"IF(Reference!A32=\"\",\"\",Reference!A32)","v":"Gas / Emmissions Leak"},null,{"$f":"IF(B36=\"\",\"\",COUNTIF('Incident Log'!$C$11:$C$500,A36))","v":""},{"$f":"IF(B36=\"\",\"\",COUNTIFS('Incident Log'!$C$11:$C$500,\"=\"&A36,'Incident Log'!$J$11:$J$500,\"=Yes\"))","v":""},null,null,null,null,null,null,"","",null,{"$f":"IF(K36=\"\",\"\",RANK(K36,$K$14:$K$500)+COUNTIF(K$14:$K36,K36)-1)","v":""},"Gas / Emmissions Leak"]
[{"$f":"IF(Reference!A33=\"\",\"\",Reference!A33)","v":"Generator Failure"},null,{"$f":"IF(B37=\"\",\"\",COUNTIF('Incident Log'!$C$11:$C$500,A37))","v":""},{"$f":"IF(B37=\"\",\"\",COUNTIFS('Incident Log'!$C$11:$C$500,\"=\"&A37,'Incident Log'!$J$11:$J$500,\"=Yes\"))","v":""},null,null,null,null,null,null,"","",null,{"$f":"IF(K37=\"\",\"\",RANK(K37,$K$14:$K$500)+COUNTIF(K$14:$K37,K37)-1)","v":""},"Generator Failure"]
[{"$f":"IF(Reference!A34=\"\",\"\",Reference!A34)","v":"Hostage Situation"},null,{"$f":"IF(B38=\"\",\"\",COUNTIF('Incident Log'!$C$11:$C$500,A38))","v":""},{"$f":"IF(B38=\"\",\"\",COUNTIFS('Incident Log'!$C$11:$C$500,\"=\"&A38,'Incident Log'!$J$11:$J$500,\"=Yes\"))","v":""},null,null,null,null,null,null,"","",null,{"$f":"IF(K38=\"\",\"\",RANK(K38,$K$14:$K$500)+COUNTIF(K$14:$K38,K38)-1)","v":""},"Hostage Situation"]
[{"$f":"IF(Reference!A35=\"\",\"\",Reference!A35)","v":"Hurricane"},null,{"$f":"IF(B39=\"\",\"\",COUNTIF('Incident Log'!$C$11:$C$500,A39))","v":""},{"$f":"IF(B39=\"\",\"\",COUNTIFS('Incident Log'!$C$11:$C$500,\"=\"&A39,'Incident Log'!$J$11:$J$500,\"=Yes\"))","v":""},null,null,null,null,null,null,"","",null,{"$f":"IF(K39=\"\",\"\",RANK(K39,$K$14:$K$500)+COUNTIF(K$14:$K39,K39)-1)","v":""},"Hurricane"]
[{"$f":"IF(Reference!A36=\"\",\"\",Reference!A36)","v":"HVAC Failure"},null,{"$f":"IF(B40=\"\",\"\",COUNTIF('Incident Log'!$C$11:$C$500,A40))","v":""},{"$f":"IF(B40=\"\",\"\",COUNTIFS('Incident Log'!$C$11:$C$500,\"=\"&A40,'Incident Log'!$J$11:$J$500,\"=Yes\"))","v":""},null,null,null,null,null,null,"","",null,{"$f":"IF(K40=\"\",\"\",RANK(K40,$K$14:$K$500)+COUNTIF(K$14:$K40,K40)-1)","v":""},"HVAC Failure"]
[{"$f":"IF(Reference!A37=\"\",\"\",Reference!A37)","v":"Inclement Weather"},null,{"$f":"IF(B41=\"\",\"\",COUNTIF('Incident Log'!$C$11:$C$500,A41))","v":""},{"$f":"IF(B41=\"\",\"\",COUNTIFS('Incident Log'!$C$11:$C$500,\"=\"&A41,'Incident Log'!$J$11:$J$500,\"=Yes\"))","v":""},null,null,null,null,null,null,"","",null,{"$f":"IF(K41=\"\",\"\",RANK(K41,$K$14:$K$500)+COUNTIF(K$14:$K41,K41)-1)","v":""},"Inclement Weather"]
[{"$f":"IF(Reference!A38=\"\",\"\",Reference!A38)","v":"Infectious Disease Outbreak"},null,{"$f":"IF(B42=\"\",\"\",COUNTIF('Incident Log'!$C$11:$C$500,A42))","v":""},{"$f":"IF(B42=\"\",\"\",COUNTIFS('Incident Log'!$C$11:$C$500,\"=\"&A42,'Incident Log'!$J$11:$J$500,\"=Yes\"))","v":""},null,null,null,null,null,null,"","",null,{"$f":"IF(K42=\"\",\"\",RANK(K42,$K$14:$K$500)+COUNTIF(K$14:$K42,K42)-1)","v":""},"Infectious Disease Outbreak"]
[{"$f":"IF(Reference!A39=\"\",\"\",Reference!A39)","v":"IT System Outage"},null,{"$f":"IF(B43=\"\",\"\",COUNTIF('Incident Log'!$C$11:$C$500,A43))","v":""},{"$f":"IF(B43=\"\",\"\",COUNTIFS('Incident Log'!$C$11:$C$500,\"=\"&A43,'Incident Log'!$J$11:$J$500,\"=Yes\"))","v":""},null,null,null,null,null,null,"","",null,{"$f":"IF(K43=\"\",\"\",RANK(K43,$K$14:$K$500)+COUNTIF(K$14:$K43,K43)-1)","v":""},"IT System Outage"]
[{"$f":"IF(Reference!A40=\"\",\"\",Reference!A40)","v":"Landslide"},null,{"$f":"IF(B44=\"\",\"\",COUNTIF('Incident Log'!$C$11:$C$500,A44))","v":""},{"$f":"IF(B44=\"\",\"\",COUNTIFS('Incident Log'!$C$11:$C$500,\"=\"&A44,'Incident Log'!$J$11:$J$500,\"=Yes\"))","v":""},null,null,null,null,null,null,"","",null,{"$f":"IF(K44=\"\",\"\",RANK(K44,$K$14:$K$500)+COUNTIF(K$14:$K44,K44)-1)","v":""},"Landslide"]
[{"$f":"IF(Reference!A41=\"\",\"\",Reference!A41)","v":"Mass Casualty Incident - Hazmat"},null,{"$f":"IF(B45=\"\",\"\",COUNTIF('Incident Log'!$C$11:$C$500,A45))","v":""},{"$f":"IF(B45=\"\",\"\",COUNTIFS('Incident Log'!$C$11:$C$500,\"=\"&A45,'Incident Log'!$J$11:$J$500,\"=Yes\"))","v":""},null,null,null,null,null,null,"","",null,{"$f":"IF(K45=\"\",\"\",RANK(K45,$K$14:$K$500)+COUNTIF(K$14:$K45,K45)-1)","v":""},"Mass Casualty Incident - Hazmat"]
[{"$f":"IF(Reference!A42=\"\",\"\",Reference!A42)","v":"Mass Casualty Incident - Medical"},null,{"$f":"IF(B46=\"\",\"\",COUNTIF('Incident Log'!$C$11:$C$500,A46))","v":""},{"$f":"IF(B46=\"\",\"\",COUNTIFS('Incident Log'!$C$11:$C$500,\"=\"&A46,'Incident Log'!$J$11:$J$500,\"=Yes\"))","v":""},null,null,null,null,null,null,{"$f":"IF(B46=\"\",\"\",ROUND(SUM(B46:D46)/L46*SUM(E46:J46)/MaxTotalScore,13))","v":""},{"$f":"IF(B46=\"\",\"\",SUM(C46:D46)+MaxScore)","v":""},null,{"$f":"IF(K46=\"\",\"\",RANK(K46,$K$14:$K$500)+COUNTIF(K$14:$K46,K46)-1)","v":""},"Mass Casualty Incident - Medical"]
[{"$f":"IF(Reference!A43=\"\",\"\",Reference!A43)","v":"Mass Casualty Incident - Trauma"},null,{"$f":"IF(B47=\"\",\"\",COUNTIF('Incident Log'!$C$11:$C$500,A47))","v":""},{"$f":"IF(B47=\"\",\"\",COUNTIFS('Incident Log'!$C$11:$C$500,\"=\"&A47,'Incident Log'!$J$11:$J$500,\"=Yes\"))","v":""},null,null,null,null,null,null,"","",null,{"$f":"IF(K47=\"\",\"\",RANK(K47,$K$14:$K$500)+COUNTIF(K$14:$K47,K47)-1)","v":""},"Mass Casualty Incident - Trauma"]
[{"$f":"IF(Reference!A44=\"\",\"\",Reference!A44)","v":"Medical Gas Disruption"},null,{"$f":"IF(B48=\"\",\"\",COUNTIF('Incident Log'!$C$11:$C$500,A48))","v":""},{"$f":"IF(B48=\"\",\"\",COUNTIFS('Incident Log'!$C$11:$C$500,\"=\"&A48,'Incident Log'!$J$11:$J$500,\"=Yes\"))","v":""},null,null,null,null,null,null,"","",null,{"$f":"IF(K48=\"\",\"\",RANK(K48,$K$14:$K$500)+COUNTIF(K$14:$K48,K48)-1)","v":""},"Medical Gas Disruption"]
[{"$f":"IF(Reference!A45=\"\",\"\",Reference!A45)","v":"Natural Gas Disruption"},null,{"$f":"IF(B49=\"\",\"\",COUNTIF('Incident Log'!$C$11:$C$500,A49))","v":""},{"$f":"IF(B49=\"\",\"\",COUNTIFS('Incident Log'!$C$11:$C$500,\"=\"&A49,'Incident Log'!$J$11:$J$500,\"=Yes\"))","v":""},null,null,null,null,null,null,"","",null,{"$f":"IF(K49=\"\",\"\",RANK(K49,$K$14:$K$500)+COUNTIF(K$14:$K49,K49)-1)","v":""},"Natural Gas Disruption"]
[{"$f":"IF(Reference!A46=\"\",\"\",Reference!A46)","v":"Pandemic"},null,{"$f":"IF(B50=\"\",\"\",COUNTIF('Incident Log'!$C$11:$C$500,A50))","v":""},{"$f":"IF(B50=\"\",\"\",COUNTIFS('Incident Log'!$C$11:$C$500,\"=\"&A50,'Incident Log'!$J$11:$J$500,\"=Yes\"))","v":""},null,null,null,null,null,null,"","",null,{"$f":"IF(K50=\"\",\"\",RANK(K50,$K$14:$K$500)+COUNTIF(K$14:$K50,K50)-1)","v":""},"Pandemic"]
[{"$f":"IF(Reference!A47=\"\",\"\",Reference!A47)","v":"Patient Elopement"},null,{"$f":"IF(B51=\"\",\"\",COUNTIF('Incident Log'!$C$11:$C$500,A51))","v":""},{"$f":"IF(B51=\"\",\"\",COUNTIFS('Incident Log'!$C$11:$C$500,\"=\"&A51,'Incident Log'!$J$11:$J$500,\"=Yes\"))","v":""},null,null,null,null,null,null,"","",null,{"$f":"IF(K51=\"\",\"\",RANK(K51,$K$14:$K$500)+COUNTIF(K$14:$K51,K51)-1)","v":""},"Patient Elopement"]
[{"$f":"IF(Reference!A48=\"\",\"\",Reference!A48)","v":"Patient Surge"},null,{"$f":"IF(B52=\"\",\"\",COUNTIF('Incident Log'!$C$11:$C$500,A52))","v":""},{"$f":"IF(B52=\"\",\"\",COUNTIFS('Incident Log'!$C$11:$C$500,\"=\"&A52,'Incident Log'!$J$11:$J$500,\"=Yes\"))","v":""},null,null,null,null,null,null,"","",null,{"$f":"IF(K52=\"\",\"\",RANK(K52,$K$14:$K$500)+COUNTIF(K$14:$K52,K52)-1)","v":""},"Patient Surge"]
[{"$f":"IF(Reference!A49=\"\",\"\",Reference!A49)","v":"Picketing"},null,{"$f":"IF(B53=\"\",\"\",COUNTIF('Incident Log'!$C$11:$C$500,A53))","v":""},{"$f":"IF(B53=\"\",\"\",COUNTIFS('Incident Log'!$C$11:$C$500,\"=\"&A53,'Incident Log'!$J$11:$J$500,\"=Yes\"))","v":""},null,null,null,null,null,null,"","",null,{"$f":"IF(K53=\"\",\"\",RANK(K53,$K$14:$K$500)+COUNTIF(K$14:$K53,K53)-1)","v":""},"Picketing"]
[{"$f":"IF(Reference!A50=\"\",\"\",Reference!A50)","v":"Planned Power Outage"},null,{"$f":"IF(B54=\"\",\"\",COUNTIF('Incident Log'!$C$11:$C$500,A54))","v":""},{"$f":"IF(B54=\"\",\"\",COUNTIFS('Incident Log'!$C$11:$C$500,\"=\"&A54,'Incident Log'!$J$11:$J$500,\"=Yes\"))","v":""},null,null,null,null,null,null,"","",null,{"$f":"IF(K54=\"\",\"\",RANK(K54,$K$14:$K$500)+COUNTIF(K$14:$K54,K54)-1)","v":""},"Planned Power Outage"]
[{"$f":"IF(Reference!A51=\"\",\"\",Reference!A51)","v":"Power Outage"},null,{"$f":"IF(B55=\"\",\"\",COUNTIF('Incident Log'!$C$11:$C$500,A55))","v":""},{"$f":"IF(B55=\"\",\"\",COUNTIFS('Incident Log'!$C$11:$C$500,\"=\"&A55,'Incident Log'!$J$11:$J$500,\"=Yes\"))","v":""},null,null,null,null,null,null,"","",null,{"$f":"IF(K55=\"\",\"\",RANK(K55,$K$14:$K$500)+COUNTIF(K$14:$K55,K55)-1)","v":""},"Power Outage"]
[{"$f":"IF(Reference!A52=\"\",\"\",Reference!A52)","v":"Radiation Exposure"},null,{"$f":"IF(B56=\"\",\"\",COUNTIF('Incident Log'!$C$11:$C$500,A56))","v":""},{"$f":"IF(B56=\"\",\"\",COUNTIFS('Incident Log'!$C$11:$C$500,\"=\"&A56,'Incident Log'!$J$11:$J$500,\"=Yes\"))","v":""},null,null,null,null,null,null,"","",null,{"$f":"IF(K56=\"\",\"\",RANK(K56,$K$14:$K$500)+COUNTIF(K$14:$K56,K56)-1)","v":""},"Radiation Exposure"]
[{"$f":"IF(Reference!A53=\"\",\"\",Reference!A53)","v":"Seasonal Influenza"},null,{"$f":"IF(B57=\"\",\"\",COUNTIF('Incident Log'!$C$11:$C$500,A57))","v":""},{"$f":"IF(B57=\"\",\"\",COUNTIFS('Incident Log'!$C$11:$C$500,\"=\"&A57,'Incident Log'!$J$11:$J$500,\"=Yes\"))","v":""},null,null,null,null,null,null,"","",null,{"$f":"IF(K57=\"\",\"\",RANK(K57,$K$14:$K$500)+COUNTIF(K$14:$K57,K57)-1)","v":""},"Seasonal Influenza"]
[{"$f":"IF(Reference!A54=\"\",\"\",Reference!A54)","v":"Sewage Failure"},null,{"$f":"IF(B58=\"\",\"\",COUNTIF('Incident Log'!$C$11:$C$500,A58))","v":""},{"$f":"IF(B58=\"\",\"\",COUNTIFS('Incident Log'!$C$11:$C$500,\"=\"&A58,'Incident Log'!$J$11:$J$500,\"=Yes\"))","v":""},null,null,null,null,null,null,"","",null,{"$f":"IF(K58=\"\",\"\",RANK(K58,$K$14:$K$500)+COUNTIF(K$14:$K58,K58)-1)","v":""},"Sewage Failure"]
[{"$f":"IF(Reference!A55=\"\",\"\",Reference!A55)","v":"Shelter in Place"},null,{"$f":"IF(B59=\"\",\"\",COUNTIF('Incident Log'!$C$11:$C$500,A59))","v":""},{"$f":"IF(B59=\"\",\"\",COUNTIFS('Incident Log'!$C$11:$C$500,\"=\"&A59,'Incident Log'!$J$11:$J$500,\"=Yes\"))","v":""},null,null,null,null,null,null,"","",null,{"$f":"IF(K59=\"\",\"\",RANK(K59,$K$14:$K$500)+COUNTIF(K$14:$K59,K59)-1)","v":""},"Shelter in Place"]
[{"$f":"IF(Reference!A56=\"\",\"\",Reference!A56)","v":"Strikes / Labor Action /  Work Stoppage"},null,{"$f":"IF(B60=\"\",\"\",COUNTIF('Incident Log'!$C$11:$C$500,A60))","v":""},{"$f":"IF(B60=\"\",\"\",COUNTIFS('Incident Log'!$C$11:$C$500,\"=\"&A60,'Incident Log'!$J$11:$J$500,\"=Yes\"))","v":""},null,null,null,null,null,null,"","",null,{"$f":"IF(K60=\"\",\"\",RANK(K60,$K$14:$K$500)+COUNTIF(K$14:$K60,K60)-1)","v":""},"Strikes / Labor Action /  Work Stoppage"]
[{"$f":"IF(Reference!A57=\"\",\"\",Reference!A57)","v":"Suicide"},null,{"$f":"IF(B61=\"\",\"\",COUNTIF('Incident Log'!$C$11:$C$500,A61))","v":""},{"$f":"IF(B61=\"\",\"\",COUNTIFS('Incident Log'!$C$11:$C$500,\"=\"&A61,'Incident Log'!$J$11:$J$500,\"=Yes\"))","v":""},null,null,null,null,null,null,"","",null,{"$f":"IF(K61=\"\",\"\",RANK(K61,$K$14:$K$500)+COUNTIF(K$14:$K61,K61)-1)","v":""},"Suicide"]
[{"$f":"IF(Reference!A58=\"\",\"\",Reference!A58)","v":"Supply Chain Shortage / Failure"},null,{"$f":"IF(B62=\"\",\"\",COUNTIF('Incident Log'!$C$11:$C$500,A62))","v":""},{"$f":"IF(B62=\"\",\"\",COUNTIFS('Incident Log'!$C$11:$C$500,\"=\"&A62,'Incident Log'!$J$11:$J$500,\"=Yes\"))","v":""},null,null,null,null,null,null,"","",null,{"$f":"IF(K62=\"\",\"\",RANK(K62,$K$14:$K$500)+COUNTIF(K$14:$K62,K62)-1)","v":""},"Supply Chain Shortage / Failure"]
[{"$f":"IF(Reference!A59=\"\",\"\",Reference!A59)","v":"Suspicious Package / Substance"},null,{"$f":"IF(B63=\"\",\"\",COUNTIF('Incident Log'!$C$11:$C$500,A63))","v":""},{"$f":"IF(B63=\"\",\"\",COUNTIFS('Incident Log'!$C$11:$C$500,\"=\"&A63,'Incident Log'!$J$11:$J$500,\"=Yes\"))","v":""},null,null,null,null,null,null,"","",null,{"$f":"IF(K63=\"\",\"\",RANK(K63,$K$14:$K$500)+COUNTIF(K$14:$K63,K63)-1)","v":""},"Suspicious Package / Substance"]
[{"$f":"IF(Reference!A60=\"\",\"\",Reference!A60)","v":"Temperature Extremes"},null,{"$f":"IF(B64=\"\",\"\",COUNTIF('Incident Log'!$C$11:$C$500,A64))","v":""},{"$f":"IF(B64=\"\",\"\",COUNTIFS('Incident Log'!$C$11:$C$500,\"=\"&A64,'Incident Log'!$J$11:$J$500,\"=Yes\"))","v":""},null,null,null,null,null,null,"","",null,{"$f":"IF(K64=\"\",\"\",RANK(K64,$K$14:$K$500)+COUNTIF(K$14:$K64,K64)-1)","v":""},"Temperature Extremes"]
[{"$f":"IF(Reference!A61=\"\",\"\",Reference!A61)","v":"Tornado"},null,{"$f":"IF(B65=\"\",\"\",COUNTIF('Incident Log'!$C$11:$C$500,A65))","v":""},{"$f":"IF(B65=\"\",\"\",COUNTIFS('Incident Log'!$C$11:$C$500,\"=\"&A65,'Incident Log'!$J$11:$J$500,\"=Yes\"))","v":""},null,null,null,null,null,null,"","",null,{"$f":"IF(K65=\"\",\"\",RANK(K65,$K$14:$K$500)+COUNTIF(K$14:$K65,K65)-1)","v":""},"Tornado"]
[{"$f":"IF(Reference!A62=\"\",\"\",Reference!A62)","v":"Transportation Failure"},null,{"$f":"IF(B66=\"\",\"\",COUNTIF('Incident Log'!$C$11:$C$500,A66))","v":""},{"$f":"IF(B66=\"\",\"\",COUNTIFS('Incident Log'!$C$11:$C$500,\"=\"&A66,'Incident Log'!$J$11:$J$500,\"=Yes\"))","v":""},null,null,null,null,null,null,"","",null,{"$f":"IF(K66=\"\",\"\",RANK(K66,$K$14:$K$500)+COUNTIF(K$14:$K66,K66)-1)","v":""},"Transportation Failure"]
[{"$f":"IF(Reference!A63=\"\",\"\",Reference!A63)","v":"Trauma"},null,{"$f":"IF(B67=\"\",\"\",COUNTIF('Incident Log'!$C$11:$C$500,A67))","v":""},{"$f":"IF(B67=\"\",\"\",COUNTIFS('Incident Log'!$C$11:$C$500,\"=\"&A67,'Incident Log'!$J$11:$J$500,\"=Yes\"))","v":""},null,null,null,null,null,null,"","",null,{"$f":"IF(K67=\"\",\"\",RANK(K67,$K$14:$K$500)+COUNTIF(K$14:$K67,K67)-1)","v":""},"Trauma"]
[{"$f":"IF(Reference!A64=\"\",\"\",Reference!A64)","v":"Tsunami"},null,{"$f":"IF(B68=\"\",\"\",COUNTIF('Incident Log'!$C$11:$C$500,A68))","v":""},{"$f":"IF(B68=\"\",\"\",COUNTIFS('Incident Log'!$C$11:$C$500,\"=\"&A68,'Incident Log'!$J$11:$J$500,\"=Yes\"))","v":""},null,null,null,null,null,null,"","",null,{"$f":"IF(K68=\"\",\"\",RANK(K68,$K$14:$K$500)+COUNTIF(K$14:$K68,K68)-1)","v":""},"Tsunami"]
[{"$f":"IF(Reference!A65=\"\",\"\",Reference!A65)","v":"Utility Failure"},null,{"$f":"IF(B69=\"\",\"\",COUNTIF('Incident Log'!$C$11:$C$500,A69))","v":""},{"$f":"IF(B69=\"\",\"\",COUNTIFS('Incident Log'!$C$11:$C$500,\"=\"&A69,'Incident Log'!$J$11:$J$500,\"=Yes\"))","v":""},null,null,null,null,null,null,"","",null,{"$f":"IF(K69=\"\",\"\",RANK(K69,$K$14:$K$500)+COUNTIF(K$14:$K69,K69)-1)","v":""},"Utility Failure"]
[{"$f":"IF(Reference!A66=\"\",\"\",Reference!A66)","v":"VIP Situation"},null,{"$f":"IF(B70=\"\",\"\",COUNTIF('Incident Log'!$C$11:$C$500,A70))","v":""},{"$f":"IF(B70=\"\",\"\",COUNTIFS('Incident Log'!$C$11:$C$500,\"=\"&A70,'Incident Log'!$J$11:$J$500,\"=Yes\"))","v":""},null,null,null,null,null,null,"","",null,{"$f":"IF(K70=\"\",\"\",RANK(K70,$K$14:$K$500)+COUNTIF(K$14:$K70,K70)-1)","v":""},"VIP Situation"]
[{"$f":"IF(Reference!A67=\"\",\"\",Reference!A67)","v":"Water Contamination"},null,{"$f":"IF(B71=\"\",\"\",COUNTIF('Incident Log'!$C$11:$C$500,A71))","v":""},{"$f":"IF(B71=\"\",\"\",COUNTIFS('Incident Log'!$C$11:$C$500,\"=\"&A71,'Incident Log'!$J$11:$J$500,\"=Yes\"))","v":""},null,null,null,null,null,null,"","",null,{"$f":"IF(K71=\"\",\"\",RANK(K71,$K$14:$K$500)+COUNTIF(K$14:$K71,K71)-1)","v":""},"Water Contamination"]
[{"$f":"IF(Reference!A68=\"\",\"\",Reference!A68)","v":"Water Disruption"},null,{"$f":"IF(B72=\"\",\"\",COUNTIF('Incident Log'!$C$11:$C$500,A72))","v":""},{"$f":"IF(B72=\"\",\"\",COUNTIFS('Incident Log'!$C$11:$C$500,\"=\"&A72,'Incident Log'!$J$11:$J$500,\"=Yes\"))","v":""},null,null,null,null,null,null,"","",null,{"$f":"IF(K72=\"\",\"\",RANK(K72,$K$14:$K$500)+COUNTIF(K$14:$K72,K72)-1)","v":""},"Water Disruption"]
[{"$f":"IF(Reference!A69=\"\",\"\",Reference!A69)","v":"Weapon"},null,{"$f":"IF(B73=\"\",\"\",COUNTIF('Incident Log'!$C$11:$C$500,A73))","v":""},{"$f":"IF(B73=\"\",\"\",COUNTIFS('Incident Log'!$C$11:$C$500,\"=\"&A73,'Incident Log'!$J$11:$J$500,\"=Yes\"))","v":""},null,null,null,null,null,null,"","",null,{"$f":"IF(K73=\"\",\"\",RANK(K73,$K$14:$K$500)+COUNTIF(K$14:$K73,K73)-1)","v":""},"Weapon"]
[{"$f":"IF(Reference!A70=\"\",\"\",Reference!A70)","v":"Workplace Violence / Threat"},null,{"$f":"IF(B74=\"\",\"\",COUNTIF('Incident Log'!$C$11:$C$500,A74))","v":""},{"$f":"IF(B74=\"\",\"\",COUNTIFS('Incident Log'!$C$11:$C$500,\"=\"&A74,'Incident Log'!$J$11:$J$500,\"=Yes\"))","v":""},null,null,null,null,null,null,"","",null,{"$f":"IF(K74=\"\",\"\",RANK(K74,$K$14:$K$500)+COUNTIF(K$14:$K74,K74)-1)","v":""},"Workplace Violence / Threat"]
[{"$f":"IF(Reference!A71=\"\",\"\",Reference!A71)","v":""},null,{"$f":"IF(B75=\"\",\"\",COUNTIF('Incident Log'!$C$11:$C$500,A75))","v":""},{"$f":"IF(B75=\"\",\"\",COUNTIFS('Incident Log'!$C$11:$C$500,\"=\"&A75,'Incident Log'!$J$11:$J$500,\"=Yes\"))","v":""},null,null,null,null,null,null,"","",null,{"$f":"IF(K75=\"\",\"\",RANK(K75,$K$14:$K$500)+COUNTIF(K$14:$K75,K75)-1)","v":""},""]

{"sheet":"Incident Log","index":3,"n_rows":10,"n_cols":18,"rows_kept":10,"cut":false,"hidden":false,"merged":[]}
[]
[]
[]
[]
[]
[{"$f":"\"Data - \"&Input!B14","v":"Data - SITE & ADDRESS"}]
[]
[]
[]
["Date","Alert Category","Alert Type","Internal / External","Responder","Location","Address","Notification Method","Point of Contact","Command Center Activation","Patient Care Impacts","Business / Operational Impacts","Structural Impacts","Resource Request","Recovery Plan Activated","AAR","End Date","Event Summary "]

{"sheet":"Summary","index":4,"n_rows":36,"n_cols":7,"rows_kept":36,"cut":false,"hidden":false,"merged":[]}
[]
[]
[]
[]
[]
[{"$f":"\"Summary For - \"&Input!B14","v":"Summary For - SITE & ADDRESS"}]
[]
[]
[]
["ALERT TYPE","OCCURRENCE"]
[{"$f":"'Incident Log'!J10","v":"Command Center Activation"},{"$f":"COUNTIF('Incident Log'!$J$11:$J$500,\"Yes\")","v":0}]
[{"$f":"'Incident Log'!K10","v":"Patient Care Impacts"},{"$f":"COUNTIF('Incident Log'!$K$11:$K$500,\"Yes\")","v":0}]
[{"$f":"'Incident Log'!L10","v":"Business / Operational Impacts"},{"$f":"COUNTIF('Incident Log'!$L$11:$L$500,\"Yes\")","v":0}]
[{"$f":"'Incident Log'!M10","v":"Structural Impacts"},{"$f":"COUNTIF('Incident Log'!$M$11:$M$500,\"Yes\")","v":0}]
[{"$f":"'Incident Log'!N10","v":"Resource Request"},{"$f":"COUNTIF('Incident Log'!$N$11:$N$500,\"Yes\")","v":0}]
[{"$f":"'Incident Log'!O10","v":"Recovery Plan Activated"},{"$f":"COUNTIF('Incident Log'!$O$11:$O$500,\"Yes\")","v":0}]
[{"$f":"'Incident Log'!P10","v":"AAR"},{"$f":"COUNTIF('Incident Log'!$P$11:$P$500,\"Yes\")","v":0}]
["Total Alert",{"$f":"COUNTA('Incident Log'!$C$11:$C$500)","v":0}]
[]
[]
[]
[]
[]
[]
[{"$f":"Input!B11","v":"YEAR"},null,null,null,{"$f":"A25","v":"YEAR"}]
["TOP 10 HVA","RANK",{"$f":"B10","v":"OCCURRENCE"},null,"TOP 10 ACTUAL ALERTS",{"$f":"B10","v":"OCCURRENCE"},"HVA RANK"]
[{"$f":"VLOOKUP(B27,HVA!N:O,2,FALSE)","v":{"$error":"#N/A"}},1,{"$f":"IF(A27=\"\",\"\",COUNTIF('Incident Log'!$C$11:$C$500,A27))","v":{"$error":"#N/A"}},null,{"$f":"IF(OR(Calculation!F11=\"\",Calculation!F11=\"Blank\"),\"\",Calculation!F11)","v":""},{"$f":"IF(Calculation!G11=\"\",\"\",Calculation!G11)","v":0},{"$f":"IFERROR(VLOOKUP(E27,HVA!$A$14:$N$100,14,FALSE),\"\")","v":""}]
[{"$f":"VLOOKUP(B28,HVA!N:O,2,FALSE)","v":{"$error":"#N/A"}},2,{"$f":"IF(A28=\"\",\"\",COUNTIF('Incident Log'!$C$11:$C$500,A28))","v":{"$error":"#N/A"}},null,{"$f":"IF(OR(Calculation!F12=\"\",Calculation!F12=\"Blank\"),\"\",Calculation!F12)","v":""},{"$f":"IF(Calculation!G12=\"\",\"\",Calculation!G12)","v":""},{"$f":"IFERROR(VLOOKUP(E28,HVA!$A$14:$N$100,14,FALSE),\"\")","v":""}]
[{"$f":"VLOOKUP(B29,HVA!N:O,2,FALSE)","v":{"$error":"#N/A"}},3,{"$f":"IF(A29=\"\",\"\",COUNTIF('Incident Log'!$C$11:$C$500,A29))","v":{"$error":"#N/A"}},null,{"$f":"IF(OR(Calculation!F13=\"\",Calculation!F13=\"Blank\"),\"\",Calculation!F13)","v":""},{"$f":"IF(Calculation!G13=\"\",\"\",Calculation!G13)","v":""},{"$f":"IFERROR(VLOOKUP(E29,HVA!$A$14:$N$100,14,FALSE),\"\")","v":""}]
[{"$f":"VLOOKUP(B30,HVA!N:O,2,FALSE)","v":{"$error":"#N/A"}},4,{"$f":"IF(A30=\"\",\"\",COUNTIF('Incident Log'!$C$11:$C$500,A30))","v":{"$error":"#N/A"}},null,{"$f":"IF(OR(Calculation!F14=\"\",Calculation!F14=\"Blank\"),\"\",Calculation!F14)","v":""},{"$f":"IF(Calculation!G14=\"\",\"\",Calculation!G14)","v":""},{"$f":"IFERROR(VLOOKUP(E30,HVA!$A$14:$N$100,14,FALSE),\"\")","v":""}]
[{"$f":"VLOOKUP(B31,HVA!N:O,2,FALSE)","v":{"$error":"#N/A"}},5,{"$f":"IF(A31=\"\",\"\",COUNTIF('Incident Log'!$C$11:$C$500,A31))","v":{"$error":"#N/A"}},null,{"$f":"IF(OR(Calculation!F15=\"\",Calculation!F15=\"Blank\"),\"\",Calculation!F15)","v":""},{"$f":"IF(Calculation!G15=\"\",\"\",Calculation!G15)","v":""},{"$f":"IFERROR(VLOOKUP(E31,HVA!$A$14:$N$100,14,FALSE),\"\")","v":""}]
[{"$f":"VLOOKUP(B32,HVA!N:O,2,FALSE)","v":{"$error":"#N/A"}},6,{"$f":"IF(A32=\"\",\"\",COUNTIF('Incident Log'!$C$11:$C$500,A32))","v":{"$error":"#N/A"}},null,{"$f":"IF(OR(Calculation!F16=\"\",Calculation!F16=\"Blank\"),\"\",Calculation!F16)","v":""},{"$f":"IF(Calculation!G16=\"\",\"\",Calculation!G16)","v":""},{"$f":"IFERROR(VLOOKUP(E32,HVA!$A$14:$N$100,14,FALSE),\"\")","v":""}]
[{"$f":"VLOOKUP(B33,HVA!N:O,2,FALSE)","v":{"$error":"#N/A"}},7,{"$f":"IF(A33=\"\",\"\",COUNTIF('Incident Log'!$C$11:$C$500,A33))","v":{"$error":"#N/A"}},null,{"$f":"IF(OR(Calculation!F17=\"\",Calculation!F17=\"Blank\"),\"\",Calculation!F17)","v":""},{"$f":"IF(Calculation!G17=\"\",\"\",Calculation!G17)","v":""},{"$f":"IFERROR(VLOOKUP(E33,HVA!$A$14:$N$100,14,FALSE),\"\")","v":""}]
[{"$f":"VLOOKUP(B34,HVA!N:O,2,FALSE)","v":{"$error":"#N/A"}},8,{"$f":"IF(A34=\"\",\"\",COUNTIF('Incident Log'!$C$11:$C$500,A34))","v":{"$error":"#N/A"}},null,{"$f":"IF(OR(Calculation!F18=\"\",Calculation!F18=\"Blank\"),\"\",Calculation!F18)","v":""},{"$f":"IF(Calculation!G18=\"\",\"\",Calculation!G18)","v":""},{"$f":"IFERROR(VLOOKUP(E34,HVA!$A$14:$N$100,14,FALSE),\"\")","v":""}]
[{"$f":"VLOOKUP(B35,HVA!N:O,2,FALSE)","v":{"$error":"#N/A"}},9,{"$f":"IF(A35=\"\",\"\",COUNTIF('Incident Log'!$C$11:$C$500,A35))","v":{"$error":"#N/A"}},null,{"$f":"IF(OR(Calculation!F19=\"\",Calculation!F19=\"Blank\"),\"\",Calculation!F19)","v":""},{"$f":"IF(Calculation!G19=\"\",\"\",Calculation!G19)","v":""},{"$f":"IFERROR(VLOOKUP(E35,HVA!$A$14:$N$100,14,FALSE),\"\")","v":""}]
[{"$f":"VLOOKUP(B36,HVA!N:O,2,FALSE)","v":{"$error":"#N/A"}},10,{"$f":"IF(A36=\"\",\"\",COUNTIF('Incident Log'!$C$11:$C$500,A36))","v":{"$error":"#N/A"}},null,{"$f":"IF(OR(Calculation!F20=\"\",Calculation!F20=\"Blank\"),\"\",Calculation!F20)","v":""},{"$f":"IF(Calculation!G20=\"\",\"\",Calculation!G20)","v":""},{"$f":"IFERROR(VLOOKUP(E36,HVA!$A$14:$N$100,14,FALSE),\"\")","v":""}]

{"sheet":"Detail","index":5,"n_rows":50,"n_cols":2,"rows_kept":50,"cut":false,"hidden":true,"merged":[]}
[]
[]
[]
[]
[]
[{"$f":"\"Detail - \"&Input!B14","v":"Detail - SITE & ADDRESS"}]
[]
[]
["Alert Type","Actual Alert"]
[{"$f":"IF(Calculation!F11=\"\",\"\",Calculation!F11)","v":"Blank"},{"$f":"IF(Calculation!G11=\"\",\"\",Calculation!G11)","v":0}]
[{"$f":"IF(Calculation!F12=\"\",\"\",Calculation!F12)","v":""},{"$f":"IF(Calculation!G12=\"\",\"\",Calculation!G12)","v":""}]
[{"$f":"IF(Calculation!F13=\"\",\"\",Calculation!F13)","v":""},{"$f":"IF(Calculation!G13=\"\",\"\",Calculation!G13)","v":""}]
[{"$f":"IF(Calculation!F14=\"\",\"\",Calculation!F14)","v":""},{"$f":"IF(Calculation!G14=\"\",\"\",Calculation!G14)","v":""}]
[{"$f":"IF(Calculation!F15=\"\",\"\",Calculation!F15)","v":""},{"$f":"IF(Calculation!G15=\"\",\"\",Calculation!G15)","v":""}]
[{"$f":"IF(Calculation!F16=\"\",\"\",Calculation!F16)","v":""},{"$f":"IF(Calculation!G16=\"\",\"\",Calculation!G16)","v":""}]
[{"$f":"IF(Calculation!F17=\"\",\"\",Calculation!F17)","v":""},{"$f":"IF(Calculation!G17=\"\",\"\",Calculation!G17)","v":""}]
[{"$f":"IF(Calculation!F18=\"\",\"\",Calculation!F18)","v":""},{"$f":"IF(Calculation!G18=\"\",\"\",Calculation!G18)","v":""}]
[{"$f":"IF(Calculation!F19=\"\",\"\",Calculation!F19)","v":""},{"$f":"IF(Calculation!G19=\"\",\"\",Calculation!G19)","v":""}]
[{"$f":"IF(Calculation!F20=\"\",\"\",Calculation!F20)","v":""},{"$f":"IF(Calculation!G20=\"\",\"\",Calculation!G20)","v":""}]
[{"$f":"IF(Calculation!F21=\"\",\"\",Calculation!F21)","v":""},{"$f":"IF(Calculation!G21=\"\",\"\",Calculation!G21)","v":""}]
[{"$f":"IF(Calculation!F22=\"\",\"\",Calculation!F22)","v":""},{"$f":"IF(Calculation!G22=\"\",\"\",Calculation!G22)","v":""}]
[{"$f":"IF(Calculation!F23=\"\",\"\",Calculation!F23)","v":""},{"$f":"IF(Calculation!G23=\"\",\"\",Calculation!G23)","v":""}]
[{"$f":"IF(Calculation!F24=\"\",\"\",Calculation!F24)","v":""},{"$f":"IF(Calculation!G24=\"\",\"\",Calculation!G24)","v":""}]
[{"$f":"IF(Calculation!F25=\"\",\"\",Calculation!F25)","v":""},{"$f":"IF(Calculation!G25=\"\",\"\",Calculation!G25)","v":""}]
[{"$f":"IF(Calculation!F26=\"\",\"\",Calculation!F26)","v":""},{"$f":"IF(Calculation!G26=\"\",\"\",Calculation!G26)","v":""}]
[{"$f":"IF(Calculation!F27=\"\",\"\",Calculation!F27)","v":""},{"$f":"IF(Calculation!G27=\"\",\"\",Calculation!G27)","v":""}]
[{"$f":"IF(Calculation!F28=\"\",\"\",Calculation!F28)","v":""},{"$f":"IF(Calculation!G28=\"\",\"\",Calculation!G28)","v":""}]
[{"$f":"IF(Calculation!F29=\"\",\"\",Calculation!F29)","v":""},{"$f":"IF(Calculation!G29=\"\",\"\",Calculation!G29)","v":""}]
[{"$f":"IF(Calculation!F30=\"\",\"\",Calculation!F30)","v":""},{"$f":"IF(Calculation!G30=\"\",\"\",Calculation!G30)","v":""}]
[{"$f":"IF(Calculation!F31=\"\",\"\",Calculation!F31)","v":""},{"$f":"IF(Calculation!G31=\"\",\"\",Calculation!G31)","v":""}]
[{"$f":"IF(Calculation!F32=\"\",\"\",Calculation!F32)","v":""},{"$f":"IF(Calculation!G32=\"\",\"\",Calculation!G32)","v":""}]
[{"$f":"IF(Calculation!F33=\"\",\"\",Calculation!F33)","v":""},{"$f":"IF(Calculation!G33=\"\",\"\",Calculation!G33)","v":""}]
[{"$f":"IF(Calculation!F34=\"\",\"\",Calculation!F34)","v":""},{"$f":"IF(Calculation!G34=\"\",\"\",Calculation!G34)","v":""}]
[{"$f":"IF(Calculation!F35=\"\",\"\",Calculation!F35)","v":""},{"$f":"IF(Calculation!G35=\"\",\"\",Calculation!G35)","v":""}]
[{"$f":"IF(Calculation!F36=\"\",\"\",Calculation!F36)","v":""},{"$f":"IF(Calculation!G36=\"\",\"\",Calculation!G36)","v":""}]
[{"$f":"IF(Calculation!F37=\"\",\"\",Calculation!F37)","v":""},{"$f":"IF(Calculation!G37=\"\",\"\",Calculation!G37)","v":""}]
[{"$f":"IF(Calculation!F38=\"\",\"\",Calculation!F38)","v":""},{"$f":"IF(Calculation!G38=\"\",\"\",Calculation!G38)","v":""}]
[{"$f":"IF(Calculation!F39=\"\",\"\",Calculation!F39)","v":""},{"$f":"IF(Calculation!G39=\"\",\"\",Calculation!G39)","v":""}]
[{"$f":"IF(Calculation!F40=\"\",\"\",Calculation!F40)","v":""},{"$f":"IF(Calculation!G40=\"\",\"\",Calculation!G40)","v":""}]
[{"$f":"IF(Calculation!F41=\"\",\"\",Calculation!F41)","v":""},{"$f":"IF(Calculation!G41=\"\",\"\",Calculation!G41)","v":""}]
[{"$f":"IF(Calculation!F42=\"\",\"\",Calculation!F42)","v":""},{"$f":"IF(Calculation!G42=\"\",\"\",Calculation!G42)","v":""}]
[{"$f":"IF(Calculation!F43=\"\",\"\",Calculation!F43)","v":""},{"$f":"IF(Calculation!G43=\"\",\"\",Calculation!G43)","v":""}]
[{"$f":"IF(Calculation!F44=\"\",\"\",Calculation!F44)","v":""},{"$f":"IF(Calculation!G44=\"\",\"\",Calculation!G44)","v":""}]
[{"$f":"IF(Calculation!F45=\"\",\"\",Calculation!F45)","v":""},{"$f":"IF(Calculation!G45=\"\",\"\",Calculation!G45)","v":""}]
[{"$f":"IF(Calculation!F46=\"\",\"\",Calculation!F46)","v":""},{"$f":"IF(Calculation!G46=\"\",\"\",Calculation!G46)","v":""}]
[{"$f":"IF(Calculation!F47=\"\",\"\",Calculation!F47)","v":""},{"$f":"IF(Calculation!G47=\"\",\"\",Calculation!G47)","v":""}]
[{"$f":"IF(Calculation!F48=\"\",\"\",Calculation!F48)","v":""},{"$f":"IF(Calculation!G48=\"\",\"\",Calculation!G48)","v":""}]
[{"$f":"IF(Calculation!F49=\"\",\"\",Calculation!F49)","v":""},{"$f":"IF(Calculation!G49=\"\",\"\",Calculation!G49)","v":""}]
[{"$f":"IF(Calculation!F50=\"\",\"\",Calculation!F50)","v":""},{"$f":"IF(Calculation!G50=\"\",\"\",Calculation!G50)","v":""}]
[{"$f":"IF(Calculation!F51=\"\",\"\",Calculation!F51)","v":""},{"$f":"IF(Calculation!G51=\"\",\"\",Calculation!G51)","v":""}]

{"sheet":"Calculation","index":6,"n_rows":500,"n_cols":7,"rows_kept":500,"cut":false,"hidden":true,"merged":[]}
[]
[]
[]
[]
[]
["Calculation"]
[]
[]
[]
[{"$f":"IF('Incident Log'!C10=\"\",\"\",'Incident Log'!C10)","v":"Alert Type"},"Alert Type 1","Count","Rank","Priority","Alert Type Final","Count 2"]
[{"$f":"IF('Incident Log'!C11=\"\",\"Blank\",'Incident Log'!C11)","v":"Blank"},{"$f":"IFERROR(INDEX($A$11:$A$500, MATCH(0, COUNTIF($B$10:B10, $A$11:$A$500), 0)),\"\")","v":"Blank"},{"$f":"IF(B11=\"\",\"\",COUNTIF('Incident Log'!$C$11:$C$500,B11))","v":0},{"$f":"IF(B11=\"\",\"\",RANK(C11,$C$11:$C$500)+COUNTIF($C$11:C11,C11)-1)","v":1},1,{"$f":"IF(B11=\"\",\"\",INDEX($B$11:$B$500,MATCH(E11,$D$11:$D$500,0)))","v":"Blank"},{"$f":"IF(B11=\"\",\"\",VLOOKUP(F11,$B$11:$C$500,2,FALSE))","v":0}]
[{"$f":"IF('Incident Log'!C12=\"\",\"\",'Incident Log'!C12)","v":""},{"$f":"IFERROR(INDEX($A$11:$A$500, MATCH(0, COUNTIF($B$10:B11, $A$11:$A$500), 0)),\"\")","v":""},{"$f":"IF(B12=\"\",\"\",COUNTIF('Incident Log'!$C$11:$C$500,B12))","v":""},{"$f":"IF(B12=\"\",\"\",RANK(C12,$C$11:$C$500)+COUNTIF($C$11:C12,C12)-1)","v":""},{"$f":"IF(B12=\"\",\"\",1+E11)","v":""},{"$f":"IF(B12=\"\",\"\",INDEX($B$11:$B$500,MATCH(E12,$D$11:$D$500,0)))","v":""},{"$f":"IF(B12=\"\",\"\",VLOOKUP(F12,$B$11:$C$500,2,FALSE))","v":""}]
[{"$f":"IF('Incident Log'!C13=\"\",\"\",'Incident Log'!C13)","v":""},{"$f":"IFERROR(INDEX($A$11:$A$500, MATCH(0, COUNTIF($B$10:B12, $A$11:$A$500), 0)),\"\")","v":""},{"$f":"IF(B13=\"\",\"\",COUNTIF('Incident Log'!$C$11:$C$500,B13))","v":""},{"$f":"IF(B13=\"\",\"\",RANK(C13,$C$11:$C$500)+COUNTIF($C$11:C13,C13)-1)","v":""},{"$f":"IF(B13=\"\",\"\",1+E12)","v":""},"",""]
[{"$f":"IF('Incident Log'!C14=\"\",\"\",'Incident Log'!C14)","v":""},{"$f":"IFERROR(INDEX($A$11:$A$500, MATCH(0, COUNTIF($B$10:B13, $A$11:$A$500), 0)),\"\")","v":""},{"$f":"IF(B14=\"\",\"\",COUNTIF('Incident Log'!$C$11:$C$500,B14))","v":""},{"$f":"IF(B14=\"\",\"\",RANK(C14,$C$11:$C$500)+COUNTIF($C$11:C14,C14)-1)","v":""},{"$f":"IF(B14=\"\",\"\",1+E13)","v":""},"",""]
[{"$f":"IF('Incident Log'!C15=\"\",\"\",'Incident Log'!C15)","v":""},{"$f":"IFERROR(INDEX($A$11:$A$500, MATCH(0, COUNTIF($B$10:B14, $A$11:$A$500), 0)),\"\")","v":""},{"$f":"IF(B15=\"\",\"\",COUNTIF('Incident Log'!$C$11:$C$500,B15))","v":""},{"$f":"IF(B15=\"\",\"\",RANK(C15,$C$11:$C$500)+COUNTIF($C$11:C15,C15)-1)","v":""},"","",""]
[{"$f":"IF('Incident Log'!C16=\"\",\"\",'Incident Log'!C16)","v":""},{"$f":"IFERROR(INDEX($A$11:$A$500, MATCH(0, COUNTIF($B$10:B15, $A$11:$A$500), 0)),\"\")","v":""},{"$f":"IF(B16=\"\",\"\",COUNTIF('Incident Log'!$C$11:$C$500,B16))","v":""},{"$f":"IF(B16=\"\",\"\",RANK(C16,$C$11:$C$500)+COUNTIF($C$11:C16,C16)-1)","v":""},"","",""]
[{"$f":"IF('Incident Log'!C17=\"\",\"\",'Incident Log'!C17)","v":""},{"$f":"IFERROR(INDEX($A$11:$A$500, MATCH(0, COUNTIF($B$10:B16, $A$11:$A$500), 0)),\"\")","v":""},{"$f":"IF(B17=\"\",\"\",COUNTIF('Incident Log'!$C$11:$C$500,B17))","v":""},{"$f":"IF(B17=\"\",\"\",RANK(C17,$C$11:$C$500)+COUNTIF($C$11:C17,C17)-1)","v":""},"","",""]
[{"$f":"IF('Incident Log'!C18=\"\",\"\",'Incident Log'!C18)","v":""},{"$f":"IFERROR(INDEX($A$11:$A$500, MATCH(0, COUNTIF($B$10:B17, $A$11:$A$500), 0)),\"\")","v":""},{"$f":"IF(B18=\"\",\"\",COUNTIF('Incident Log'!$C$11:$C$500,B18))","v":""},{"$f":"IF(B18=\"\",\"\",RANK(C18,$C$11:$C$500)+COUNTIF($C$11:C18,C18)-1)","v":""},"","",""]
[{"$f":"IF('Incident Log'!C19=\"\",\"\",'Incident Log'!C19)","v":""},{"$f":"IFERROR(INDEX($A$11:$A$500, MATCH(0, COUNTIF($B$10:B18, $A$11:$A$500), 0)),\"\")","v":""},{"$f":"IF(B19=\"\",\"\",COUNTIF('Incident Log'!$C$11:$C$500,B19))","v":""},{"$f":"IF(B19=\"\",\"\",RANK(C19,$C$11:$C$500)+COUNTIF($C$11:C19,C19)-1)","v":""},"","",""]
[{"$f":"IF('Incident Log'!C20=\"\",\"\",'Incident Log'!C20)","v":""},{"$f":"IFERROR(INDEX($A$11:$A$500, MATCH(0, COUNTIF($B$10:B19, $A$11:$A$500), 0)),\"\")","v":""},{"$f":"IF(B20=\"\",\"\",COUNTIF('Incident Log'!$C$11:$C$500,B20))","v":""},{"$f":"IF(B20=\"\",\"\",RANK(C20,$C$11:$C$500)+COUNTIF($C$11:C20,C20)-1)","v":""},"","",""]
[{"$f":"IF('Incident Log'!C21=\"\",\"\",'Incident Log'!C21)","v":""},{"$f":"IFERROR(INDEX($A$11:$A$500, MATCH(0, COUNTIF($B$10:B20, $A$11:$A$500), 0)),\"\")","v":""},{"$f":"IF(B21=\"\",\"\",COUNTIF('Incident Log'!$C$11:$C$500,B21))","v":""},{"$f":"IF(B21=\"\",\"\",RANK(C21,$C$11:$C$500)+COUNTIF($C$11:C21,C21)-1)","v":""},"","",""]
[{"$f":"IF('Incident Log'!C22=\"\",\"\",'Incident Log'!C22)","v":""},{"$f":"IFERROR(INDEX($A$11:$A$500, MATCH(0, COUNTIF($B$10:B21, $A$11:$A$500), 0)),\"\")","v":""},{"$f":"IF(B22=\"\",\"\",COUNTIF('Incident Log'!$C$11:$C$500,B22))","v":""},{"$f":"IF(B22=\"\",\"\",RANK(C22,$C$11:$C$500)+COUNTIF($C$11:C22,C22)-1)","v":""},"","",""]
[{"$f":"IF('Incident Log'!C23=\"\",\"\",'Incident Log'!C23)","v":""},{"$f":"IFERROR(INDEX($A$11:$A$500, MATCH(0, COUNTIF($B$10:B22, $A$11:$A$500), 0)),\"\")","v":""},{"$f":"IF(B23=\"\",\"\",COUNTIF('Incident Log'!$C$11:$C$500,B23))","v":""},{"$f":"IF(B23=\"\",\"\",RANK(C23,$C$11:$C$500)+COUNTIF($C$11:C23,C23)-1)","v":""},"","",""]
[{"$f":"IF('Incident Log'!C24=\"\",\"\",'Incident Log'!C24)","v":""},{"$f":"IFERROR(INDEX($A$11:$A$500, MATCH(0, COUNTIF($B$10:B23, $A$11:$A$500), 0)),\"\")","v":""},{"$f":"IF(B24=\"\",\"\",COUNTIF('Incident Log'!$C$11:$C$500,B24))","v":""},{"$f":"IF(B24=\"\",\"\",RANK(C24,$C$11:$C$500)+COUNTIF($C$11:C24,C24)-1)","v":""},"","",""]
[{"$f":"IF('Incident Log'!C25=\"\",\"\",'Incident Log'!C25)","v":""},{"$f":"IFERROR(INDEX($A$11:$A$500, MATCH(0, COUNTIF($B$10:B24, $A$11:$A$500), 0)),\"\")","v":""},{"$f":"IF(B25=\"\",\"\",COUNTIF('Incident Log'!$C$11:$C$500,B25))","v":""},{"$f":"IF(B25=\"\",\"\",RANK(C25,$C$11:$C$500)+COUNTIF($C$11:C25,C25)-1)","v":""},"","",""]
[{"$f":"IF('Incident Log'!C26=\"\",\"\",'Incident Log'!C26)","v":""},{"$f":"IFERROR(INDEX($A$11:$A$500, MATCH(0, COUNTIF($B$10:B25, $A$11:$A$500), 0)),\"\")","v":""},{"$f":"IF(B26=\"\",\"\",COUNTIF('Incident Log'!$C$11:$C$500,B26))","v":""},{"$f":"IF(B26=\"\",\"\",RANK(C26,$C$11:$C$500)+COUNTIF($C$11:C26,C26)-1)","v":""},"","",""]
[{"$f":"IF('Incident Log'!C27=\"\",\"\",'Incident Log'!C27)","v":""},{"$f":"IFERROR(INDEX($A$11:$A$500, MATCH(0, COUNTIF($B$10:B26, $A$11:$A$500), 0)),\"\")","v":""},{"$f":"IF(B27=\"\",\"\",COUNTIF('Incident Log'!$C$11:$C$500,B27))","v":""},{"$f":"IF(B27=\"\",\"\",RANK(C27,$C$11:$C$500)+COUNTIF($C$11:C27,C27)-1)","v":""},"","",""]
[{"$f":"IF('Incident Log'!C28=\"\",\"\",'Incident Log'!C28)","v":""},{"$f":"IFERROR(INDEX($A$11:$A$500, MATCH(0, COUNTIF($B$10:B27, $A$11:$A$500), 0)),\"\")","v":""},{"$f":"IF(B28=\"\",\"\",COUNTIF('Incident Log'!$C$11:$C$500,B28))","v":""},{"$f":"IF(B28=\"\",\"\",RANK(C28,$C$11:$C$500)+COUNTIF($C$11:C28,C28)-1)","v":""},"","",""]
[{"$f":"IF('Incident Log'!C29=\"\",\"\",'Incident Log'!C29)","v":""},{"$f":"IFERROR(INDEX($A$11:$A$500, MATCH(0, COUNTIF($B$10:B28, $A$11:$A$500), 0)),\"\")","v":""},{"$f":"IF(B29=\"\",\"\",COUNTIF('Incident Log'!$C$11:$C$500,B29))","v":""},{"$f":"IF(B29=\"\",\"\",RANK(C29,$C$11:$C$500)+COUNTIF($C$11:C29,C29)-1)","v":""},"","",""]
[{"$f":"IF('Incident Log'!C30=\"\",\"\",'Incident Log'!C30)","v":""},{"$f":"IFERROR(INDEX($A$11:$A$500, MATCH(0, COUNTIF($B$10:B29, $A$11:$A$500), 0)),\"\")","v":""},{"$f":"IF(B30=\"\",\"\",COUNTIF('Incident Log'!$C$11:$C$500,B30))","v":""},{"$f":"IF(B30=\"\",\"\",RANK(C30,$C$11:$C$500)+COUNTIF($C$11:C30,C30)-1)","v":""},"","",""]
[{"$f":"IF('Incident Log'!C31=\"\",\"\",'Incident Log'!C31)","v":""},{"$f":"IFERROR(INDEX($A$11:$A$500, MATCH(0, COUNTIF($B$10:B30, $A$11:$A$500), 0)),\"\")","v":""},{"$f":"IF(B31=\"\",\"\",COUNTIF('Incident Log'!$C$11:$C$500,B31))","v":""},{"$f":"IF(B31=\"\",\"\",RANK(C31,$C$11:$C$500)+COUNTIF($C$11:C31,C31)-1)","v":""},"","",""]
[{"$f":"IF('Incident Log'!C32=\"\",\"\",'Incident Log'!C32)","v":""},{"$f":"IFERROR(INDEX($A$11:$A$500, MATCH(0, COUNTIF($B$10:B31, $A$11:$A$500), 0)),\"\")","v":""},{"$f":"IF(B32=\"\",\"\",COUNTIF('Incident Log'!$C$11:$C$500,B32))","v":""},{"$f":"IF(B32=\"\",\"\",RANK(C32,$C$11:$C$500)+COUNTIF($C$11:C32,C32)-1)","v":""},"","",""]
[{"$f":"IF('Incident Log'!C33=\"\",\"\",'Incident Log'!C33)","v":""},{"$f":"IFERROR(INDEX($A$11:$A$500, MATCH(0, COUNTIF($B$10:B32, $A$11:$A$500), 0)),\"\")","v":""},{"$f":"IF(B33=\"\",\"\",COUNTIF('Incident Log'!$C$11:$C$500,B33))","v":""},{"$f":"IF(B33=\"\",\"\",RANK(C33,$C$11:$C$500)+COUNTIF($C$11:C33,C33)-1)","v":""},"","",""]
[{"$f":"IF('Incident Log'!C34=\"\",\"\",'Incident Log'!C34)","v":""},{"$f":"IFERROR(INDEX($A$11:$A$500, MATCH(0, COUNTIF($B$10:B33, $A$11:$A$500), 0)),\"\")","v":""},{"$f":"IF(B34=\"\",\"\",COUNTIF('Incident Log'!$C$11:$C$500,B34))","v":""},{"$f":"IF(B34=\"\",\"\",RANK(C34,$C$11:$C$500)+COUNTIF($C$11:C34,C34)-1)","v":""},"","",""]
[{"$f":"IF('Incident Log'!C35=\"\",\"\",'Incident Log'!C35)","v":""},{"$f":"IFERROR(INDEX($A$11:$A$500, MATCH(0, COUNTIF($B$10:B34, $A$11:$A$500), 0)),\"\")","v":""},{"$f":"IF(B35=\"\",\"\",COUNTIF('Incident Log'!$C$11:$C$500,B35))","v":""},{"$f":"IF(B35=\"\",\"\",RANK(C35,$C$11:$C$500)+COUNTIF($C$11:C35,C35)-1)","v":""},"","",""]
[{"$f":"IF('Incident Log'!C36=\"\",\"\",'Incident Log'!C36)","v":""},{"$f":"IFERROR(INDEX($A$11:$A$500, MATCH(0, COUNTIF($B$10:B35, $A$11:$A$500), 0)),\"\")","v":""},{"$f":"IF(B36=\"\",\"\",COUNTIF('Incident Log'!$C$11:$C$500,B36))","v":""},{"$f":"IF(B36=\"\",\"\",RANK(C36,$C$11:$C$500)+COUNTIF($C$11:C36,C36)-1)","v":""},"","",""]
[{"$f":"IF('Incident Log'!C37=\"\",\"\",'Incident Log'!C37)","v":""},{"$f":"IFERROR(INDEX($A$11:$A$500, MATCH(0, COUNTIF($B$10:B36, $A$11:$A$500), 0)),\"\")","v":""},{"$f":"IF(B37=\"\",\"\",COUNTIF('Incident Log'!$C$11:$C$500,B37))","v":""},{"$f":"IF(B37=\"\",\"\",RANK(C37,$C$11:$C$500)+COUNTIF($C$11:C37,C37)-1)","v":""},"","",""]
[{"$f":"IF('Incident Log'!C38=\"\",\"\",'Incident Log'!C38)","v":""},{"$f":"IFERROR(INDEX($A$11:$A$500, MATCH(0, COUNTIF($B$10:B37, $A$11:$A$500), 0)),\"\")","v":""},{"$f":"IF(B38=\"\",\"\",COUNTIF('Incident Log'!$C$11:$C$500,B38))","v":""},{"$f":"IF(B38=\"\",\"\",RANK(C38,$C$11:$C$500)+COUNTIF($C$11:C38,C38)-1)","v":""},"","",""]
[{"$f":"IF('Incident Log'!C39=\"\",\"\",'Incident Log'!C39)","v":""},{"$f":"IFERROR(INDEX($A$11:$A$500, MATCH(0, COUNTIF($B$10:B38, $A$11:$A$500), 0)),\"\")","v":""},{"$f":"IF(B39=\"\",\"\",COUNTIF('Incident Log'!$C$11:$C$500,B39))","v":""},{"$f":"IF(B39=\"\",\"\",RANK(C39,$C$11:$C$500)+COUNTIF($C$11:C39,C39)-1)","v":""},"","",""]
[{"$f":"IF('Incident Log'!C40=\"\",\"\",'Incident Log'!C40)","v":""},{"$f":"IFERROR(INDEX($A$11:$A$500, MATCH(0, COUNTIF($B$10:B39, $A$11:$A$500), 0)),\"\")","v":""},{"$f":"IF(B40=\"\",\"\",COUNTIF('Incident Log'!$C$11:$C$500,B40))","v":""},{"$f":"IF(B40=\"\",\"\",RANK(C40,$C$11:$C$500)+COUNTIF($C$11:C40,C40)-1)","v":""},"","",""]
[{"$f":"IF('Incident Log'!C41=\"\",\"\",'Incident Log'!C41)","v":""},{"$f":"IFERROR(INDEX($A$11:$A$500, MATCH(0, COUNTIF($B$10:B40, $A$11:$A$500), 0)),\"\")","v":""},{"$f":"IF(B41=\"\",\"\",COUNTIF('Incident Log'!$C$11:$C$500,B41))","v":""},{"$f":"IF(B41=\"\",\"\",RANK(C41,$C$11:$C$500)+COUNTIF($C$11:C41,C41)-1)","v":""},"","",""]
[{"$f":"IF('Incident Log'!C42=\"\",\"\",'Incident Log'!C42)","v":""},{"$f":"IFERROR(INDEX($A$11:$A$500, MATCH(0, COUNTIF($B$10:B41, $A$11:$A$500), 0)),\"\")","v":""},{"$f":"IF(B42=\"\",\"\",COUNTIF('Incident Log'!$C$11:$C$500,B42))","v":""},{"$f":"IF(B42=\"\",\"\",RANK(C42,$C$11:$C$500)+COUNTIF($C$11:C42,C42)-1)","v":""},"","",""]
[{"$f":"IF('Incident Log'!C43=\"\",\"\",'Incident Log'!C43)","v":""},{"$f":"IFERROR(INDEX($A$11:$A$500, MATCH(0, COUNTIF($B$10:B42, $A$11:$A$500), 0)),\"\")","v":""},{"$f":"IF(B43=\"\",\"\",COUNTIF('Incident Log'!$C$11:$C$500,B43))","v":""},{"$f":"IF(B43=\"\",\"\",RANK(C43,$C$11:$C$500)+COUNTIF($C$11:C43,C43)-1)","v":""},"","",""]
[{"$f":"IF('Incident Log'!C44=\"\",\"\",'Incident Log'!C44)","v":""},{"$f":"IFERROR(INDEX($A$11:$A$500, MATCH(0, COUNTIF($B$10:B43, $A$11:$A$500), 0)),\"\")","v":""},{"$f":"IF(B44=\"\",\"\",COUNTIF('Incident Log'!$C$11:$C$500,B44))","v":""},{"$f":"IF(B44=\"\",\"\",RANK(C44,$C$11:$C$500)+COUNTIF($C$11:C44,C44)-1)","v":""},"","",""]
[{"$f":"IF('Incident Log'!C45=\"\",\"\",'Incident Log'!C45)","v":""},{"$f":"IFERROR(INDEX($A$11:$A$500, MATCH(0, COUNTIF($B$10:B44, $A$11:$A$500), 0)),\"\")","v":""},{"$f":"IF(B45=\"\",\"\",COUNTIF('Incident Log'!$C$11:$C$500,B45))","v":""},{"$f":"IF(B45=\"\",\"\",RANK(C45,$C$11:$C$500)+COUNTIF($C$11:C45,C45)-1)","v":""},"","",""]
[{"$f":"IF('Incident Log'!C46=\"\",\"\",'Incident Log'!C46)","v":""},{"$f":"IFERROR(INDEX($A$11:$A$500, MATCH(0, COUNTIF($B$10:B45, $A$11:$A$500), 0)),\"\")","v":""},{"$f":"IF(B46=\"\",\"\",COUNTIF('Incident Log'!$C$11:$C$500,B46))","v":""},{"$f":"IF(B46=\"\",\"\",RANK(C46,$C$11:$C$500)+COUNTIF($C$11:C46,C46)-1)","v":""},"","",""]
[{"$f":"IF('Incident Log'!C47=\"\",\"\",'Incident Log'!C47)","v":""},{"$f":"IFERROR(INDEX($A$11:$A$500, MATCH(0, COUNTIF($B$10:B46, $A$11:$A$500), 0)),\"\")","v":""},{"$f":"IF(B47=\"\",\"\",COUNTIF('Incident Log'!$C$11:$C$500,B47))","v":""},{"$f":"IF(B47=\"\",\"\",RANK(C47,$C$11:$C$500)+COUNTIF($C$11:C47,C47)-1)","v":""},"","",""]
[{"$f":"IF('Incident Log'!C48=\"\",\"\",'Incident Log'!C48)","v":""},{"$f":"IFERROR(INDEX($A$11:$A$500, MATCH(0, COUNTIF($B$10:B47, $A$11:$A$500), 0)),\"\")","v":""},{"$f":"IF(B48=\"\",\"\",COUNTIF('Incident Log'!$C$11:$C$500,B48))","v":""},{"$f":"IF(B48=\"\",\"\",RANK(C48,$C$11:$C$500)+COUNTIF($C$11:C48,C48)-1)","v":""},"","",""]
[{"$f":"IF('Incident Log'!C49=\"\",\"\",'Incident Log'!C49)","v":""},{"$f":"IFERROR(INDEX($A$11:$A$500, MATCH(0, COUNTIF($B$10:B48, $A$11:$A$500), 0)),\"\")","v":""},{"$f":"IF(B49=\"\",\"\",COUNTIF('Incident Log'!$C$11:$C$500,B49))","v":""},{"$f":"IF(B49=\"\",\"\",RANK(C49,$C$11:$C$500)+COUNTIF($C$11:C49,C49)-1)","v":""},"","",""]
[{"$f":"IF('Incident Log'!C50=\"\",\"\",'Incident Log'!C50)","v":""},{"$f":"IFERROR(INDEX($A$11:$A$500, MATCH(0, COUNTIF($B$10:B49, $A$11:$A$500), 0)),\"\")","v":""},{"$f":"IF(B50=\"\",\"\",COUNTIF('Incident Log'!$C$11:$C$500,B50))","v":""},{"$f":"IF(B50=\"\",\"\",RANK(C50,$C$11:$C$500)+COUNTIF($C$11:C50,C50)-1)","v":""},"","",""]
[{"$f":"IF('Incident Log'!C51=\"\",\"\",'Incident Log'!C51)","v":""},{"$f":"IFERROR(INDEX($A$11:$A$500, MATCH(0, COUNTIF($B$10:B50, $A$11:$A$500), 0)),\"\")","v":""},{"$f":"IF(B51=\"\",\"\",COUNTIF('Incident Log'!$C$11:$C$500,B51))","v":""},{"$f":"IF(B51=\"\",\"\",RANK(C51,$C$11:$C$500)+COUNTIF($C$11:C51,C51)-1)","v":""},"","",""]
[{"$f":"IF('Incident Log'!C52=\"\",\"\",'Incident Log'!C52)","v":""},{"$f":"IFERROR(INDEX($A$11:$A$500, MATCH(0, COUNTIF($B$10:B51, $A$11:$A$500), 0)),\"\")","v":""},{"$f":"IF(B52=\"\",\"\",COUNTIF('Incident Log'!$C$11:$C$500,B52))","v":""},{"$f":"IF(B52=\"\",\"\",RANK(C52,$C$11:$C$500)+COUNTIF($C$11:C52,C52)-1)","v":""},"","",""]
[{"$f":"IF('Incident Log'!C53=\"\",\"\",'Incident Log'!C53)","v":""},{"$f":"IFERROR(INDEX($A$11:$A$500, MATCH(0, COUNTIF($B$10:B52, $A$11:$A$500), 0)),\"\")","v":""},{"$f":"IF(B53=\"\",\"\",COUNTIF('Incident Log'!$C$11:$C$500,B53))","v":""},{"$f":"IF(B53=\"\",\"\",RANK(C53,$C$11:$C$500)+COUNTIF($C$11:C53,C53)-1)","v":""},"","",""]
[{"$f":"IF('Incident Log'!C54=\"\",\"\",'Incident Log'!C54)","v":""},{"$f":"IFERROR(INDEX($A$11:$A$500, MATCH(0, COUNTIF($B$10:B53, $A$11:$A$500), 0)),\"\")","v":""},{"$f":"IF(B54=\"\",\"\",COUNTIF('Incident Log'!$C$11:$C$500,B54))","v":""},{"$f":"IF(B54=\"\",\"\",RANK(C54,$C$11:$C$500)+COUNTIF($C$11:C54,C54)-1)","v":""},"","",""]
[{"$f":"IF('Incident Log'!C55=\"\",\"\",'Incident Log'!C55)","v":""},{"$f":"IFERROR(INDEX($A$11:$A$500, MATCH(0, COUNTIF($B$10:B54, $A$11:$A$500), 0)),\"\")","v":""},{"$f":"IF(B55=\"\",\"\",COUNTIF('Incident Log'!$C$11:$C$500,B55))","v":""},{"$f":"IF(B55=\"\",\"\",RANK(C55,$C$11:$C$500)+COUNTIF($C$11:C55,C55)-1)","v":""},"","",""]
[{"$f":"IF('Incident Log'!C56=\"\",\"\",'Incident Log'!C56)","v":""},{"$f":"IFERROR(INDEX($A$11:$A$500, MATCH(0, COUNTIF($B$10:B55, $A$11:$A$500), 0)),\"\")","v":""},{"$f":"IF(B56=\"\",\"\",COUNTIF('Incident Log'!$C$11:$C$500,B56))","v":""},{"$f":"IF(B56=\"\",\"\",RANK(C56,$C$11:$C$500)+COUNTIF($C$11:C56,C56)-1)","v":""},"","",""]
[{"$f":"IF('Incident Log'!C57=\"\",\"\",'Incident Log'!C57)","v":""},{"$f":"IFERROR(INDEX($A$11:$A$500, MATCH(0, COUNTIF($B$10:B56, $A$11:$A$500), 0)),\"\")","v":""},{"$f":"IF(B57=\"\",\"\",COUNTIF('Incident Log'!$C$11:$C$500,B57))","v":""},{"$f":"IF(B57=\"\",\"\",RANK(C57,$C$11:$C$500)+COUNTIF($C$11:C57,C57)-1)","v":""},"","",""]
[{"$f":"IF('Incident Log'!C58=\"\",\"\",'Incident Log'!C58)","v":""},{"$f":"IFERROR(INDEX($A$11:$A$500, MATCH(0, COUNTIF($B$10:B57, $A$11:$A$500), 0)),\"\")","v":""},{"$f":"IF(B58=\"\",\"\",COUNTIF('Incident Log'!$C$11:$C$500,B58))","v":""},{"$f":"IF(B58=\"\",\"\",RANK(C58,$C$11:$C$500)+COUNTIF($C$11:C58,C58)-1)","v":""},"","",""]
[{"$f":"IF('Incident Log'!C59=\"\",\"\",'Incident Log'!C59)","v":""},{"$f":"IFERROR(INDEX($A$11:$A$500, MATCH(0, COUNTIF($B$10:B58, $A$11:$A$500), 0)),\"\")","v":""},{"$f":"IF(B59=\"\",\"\",COUNTIF('Incident Log'!$C$11:$C$500,B59))","v":""},{"$f":"IF(B59=\"\",\"\",RANK(C59,$C$11:$C$500)+COUNTIF($C$11:C59,C59)-1)","v":""},"","",""]
[{"$f":"IF('Incident Log'!C60=\"\",\"\",'Incident Log'!C60)","v":""},{"$f":"IFERROR(INDEX($A$11:$A$500, MATCH(0, COUNTIF($B$10:B59, $A$11:$A$500), 0)),\"\")","v":""},{"$f":"IF(B60=\"\",\"\",COUNTIF('Incident Log'!$C$11:$C$500,B60))","v":""},{"$f":"IF(B60=\"\",\"\",RANK(C60,$C$11:$C$500)+COUNTIF($C$11:C60,C60)-1)","v":""},"","",""]
[{"$f":"IF('Incident Log'!C61=\"\",\"\",'Incident Log'!C61)","v":""},{"$f":"IFERROR(INDEX($A$11:$A$500, MATCH(0, COUNTIF($B$10:B60, $A$11:$A$500), 0)),\"\")","v":""},{"$f":"IF(B61=\"\",\"\",COUNTIF('Incident Log'!$C$11:$C$500,B61))","v":""},{"$f":"IF(B61=\"\",\"\",RANK(C61,$C$11:$C$500)+COUNTIF($C$11:C61,C61)-1)","v":""},"","",""]
[{"$f":"IF('Incident Log'!C62=\"\",\"\",'Incident Log'!C62)","v":""},{"$f":"IFERROR(INDEX($A$11:$A$500, MATCH(0, COUNTIF($B$10:B61, $A$11:$A$500), 0)),\"\")","v":""},{"$f":"IF(B62=\"\",\"\",COUNTIF('Incident Log'!$C$11:$C$500,B62))","v":""},{"$f":"IF(B62=\"\",\"\",RANK(C62,$C$11:$C$500)+COUNTIF($C$11:C62,C62)-1)","v":""},"","",""]
[{"$f":"IF('Incident Log'!C63=\"\",\"\",'Incident Log'!C63)","v":""},{"$f":"IFERROR(INDEX($A$11:$A$500, MATCH(0, COUNTIF($B$10:B62, $A$11:$A$500), 0)),\"\")","v":""},{"$f":"IF(B63=\"\",\"\",COUNTIF('Incident Log'!$C$11:$C$500,B63))","v":""},{"$f":"IF(B63=\"\",\"\",RANK(C63,$C$11:$C$500)+COUNTIF($C$11:C63,C63)-1)","v":""},"","",""]
[{"$f":"IF('Incident Log'!C64=\"\",\"\",'Incident Log'!C64)","v":""},{"$f":"IFERROR(INDEX($A$11:$A$500, MATCH(0, COUNTIF($B$10:B63, $A$11:$A$500), 0)),\"\")","v":""},{"$f":"IF(B64=\"\",\"\",COUNTIF('Incident Log'!$C$11:$C$500,B64))","v":""},{"$f":"IF(B64=\"\",\"\",RANK(C64,$C$11:$C$500)+COUNTIF($C$11:C64,C64)-1)","v":""},"","",""]
[{"$f":"IF('Incident Log'!C65=\"\",\"\",'Incident Log'!C65)","v":""},{"$f":"IFERROR(INDEX($A$11:$A$500, MATCH(0, COUNTIF($B$10:B64, $A$11:$A$500), 0)),\"\")","v":""},{"$f":"IF(B65=\"\",\"\",COUNTIF('Incident Log'!$C$11:$C$500,B65))","v":""},{"$f":"IF(B65=\"\",\"\",RANK(C65,$C$11:$C$500)+COUNTIF($C$11:C65,C65)-1)","v":""},"","",""]
[{"$f":"IF('Incident Log'!C66=\"\",\"\",'Incident Log'!C66)","v":""},{"$f":"IFERROR(INDEX($A$11:$A$500, MATCH(0, COUNTIF($B$10:B65, $A$11:$A$500), 0)),\"\")","v":""},{"$f":"IF(B66=\"\",\"\",COUNTIF('Incident Log'!$C$11:$C$500,B66))","v":""},{"$f":"IF(B66=\"\",\"\",RANK(C66,$C$11:$C$500)+COUNTIF($C$11:C66,C66)-1)","v":""},"","",""]
[{"$f":"IF('Incident Log'!C67=\"\",\"\",'Incident Log'!C67)","v":""},{"$f":"IFERROR(INDEX($A$11:$A$500, MATCH(0, COUNTIF($B$10:B66, $A$11:$A$500), 0)),\"\")","v":""},{"$f":"IF(B67=\"\",\"\",COUNTIF('Incident Log'!$C$11:$C$500,B67))","v":""},{"$f":"IF(B67=\"\",\"\",RANK(C67,$C$11:$C$500)+COUNTIF($C$11:C67,C67)-1)","v":""},"","",""]
[{"$f":"IF('Incident Log'!C68=\"\",\"\",'Incident Log'!C68)","v":""},{"$f":"IFERROR(INDEX($A$11:$A$500, MATCH(0, COUNTIF($B$10:B67, $A$11:$A$500), 0)),\"\")","v":""},{"$f":"IF(B68=\"\",\"\",COUNTIF('Incident Log'!$C$11:$C$500,B68))","v":""},{"$f":"IF(B68=\"\",\"\",RANK(C68,$C$11:$C$500)+COUNTIF($C$11:C68,C68)-1)","v":""},"","",""]
[{"$f":"IF('Incident Log'!C69=\"\",\"\",'Incident Log'!C69)","v":""},{"$f":"IFERROR(INDEX($A$11:$A$500, MATCH(0, COUNTIF($B$10:B68, $A$11:$A$500), 0)),\"\")","v":""},{"$f":"IF(B69=\"\",\"\",COUNTIF('Incident Log'!$C$11:$C$500,B69))","v":""},{"$f":"IF(B69=\"\",\"\",RANK(C69,$C$11:$C$500)+COUNTIF($C$11:C69,C69)-1)","v":""},"","",""]
[{"$f":"IF('Incident Log'!C70=\"\",\"\",'Incident Log'!C70)","v":""},{"$f":"IFERROR(INDEX($A$11:$A$500, MATCH(0, COUNTIF($B$10:B69, $A$11:$A$500), 0)),\"\")","v":""},{"$f":"IF(B70=\"\",\"\",COUNTIF('Incident Log'!$C$11:$C$500,B70))","v":""},{"$f":"IF(B70=\"\",\"\",RANK(C70,$C$11:$C$500)+COUNTIF($C$11:C70,C70)-1)","v":""},"","",""]
[{"$f":"IF('Incident Log'!C71=\"\",\"\",'Incident Log'!C71)","v":""},{"$f":"IFERROR(INDEX($A$11:$A$500, MATCH(0, COUNTIF($B$10:B70, $A$11:$A$500), 0)),\"\")","v":""},{"$f":"IF(B71=\"\",\"\",COUNTIF('Incident Log'!$C$11:$C$500,B71))","v":""},{"$f":"IF(B71=\"\",\"\",RANK(C71,$C$11:$C$500)+COUNTIF($C$11:C71,C71)-1)","v":""},"","",""]
[{"$f":"IF('Incident Log'!C72=\"\",\"\",'Incident Log'!C72)","v":""},{"$f":"IFERROR(INDEX($A$11:$A$500, MATCH(0, COUNTIF($B$10:B71, $A$11:$A$500), 0)),\"\")","v":""},{"$f":"IF(B72=\"\",\"\",COUNTIF('Incident Log'!$C$11:$C$500,B72))","v":""},{"$f":"IF(B72=\"\",\"\",RANK(C72,$C$11:$C$500)+COUNTIF($C$11:C72,C72)-1)","v":""},"","",""]
[{"$f":"IF('Incident Log'!C73=\"\",\"\",'Incident Log'!C73)","v":""},{"$f":"IFERROR(INDEX($A$11:$A$500, MATCH(0, COUNTIF($B$10:B72, $A$11:$A$500), 0)),\"\")","v":""},{"$f":"IF(B73=\"\",\"\",COUNTIF('Incident Log'!$C$11:$C$500,B73))","v":""},{"$f":"IF(B73=\"\",\"\",RANK(C73,$C$11:$C$500)+COUNTIF($C$11:C73,C73)-1)","v":""},"","",""]
[{"$f":"IF('Incident Log'!C74=\"\",\"\",'Incident Log'!C74)","v":""},{"$f":"IFERROR(INDEX($A$11:$A$500, MATCH(0, COUNTIF($B$10:B73, $A$11:$A$500), 0)),\"\")","v":""},{"$f":"IF(B74=\"\",\"\",COUNTIF('Incident Log'!$C$11:$C$500,B74))","v":""},{"$f":"IF(B74=\"\",\"\",RANK(C74,$C$11:$C$500)+COUNTIF($C$11:C74,C74)-1)","v":""},"","",""]
[{"$f":"IF('Incident Log'!C75=\"\",\"\",'Incident Log'!C75)","v":""},{"$f":"IFERROR(INDEX($A$11:$A$500, MATCH(0, COUNTIF($B$10:B74, $A$11:$A$500), 0)),\"\")","v":""},{"$f":"IF(B75=\"\",\"\",COUNTIF('Incident Log'!$C$11:$C$500,B75))","v":""},{"$f":"IF(B75=\"\",\"\",RANK(C75,$C$11:$C$500)+COUNTIF($C$11:C75,C75)-1)","v":""},"","",""]
[{"$f":"IF('Incident Log'!C76=\"\",\"\",'Incident Log'!C76)","v":""},{"$f":"IFERROR(INDEX($A$11:$A$500, MATCH(0, COUNTIF($B$10:B75, $A$11:$A$500), 0)),\"\")","v":""},{"$f":"IF(B76=\"\",\"\",COUNTIF('Incident Log'!$C$11:$C$500,B76))","v":""},{"$f":"IF(B76=\"\",\"\",RANK(C76,$C$11:$C$500)+COUNTIF($C$11:C76,C76)-1)","v":""},"",{"$f":"IF(B76=\"\",\"\",INDEX($B$11:$B$500,MATCH(E76,$D$11:$D$500,0)))","v":""},{"$f":"IF(B76=\"\",\"\",VLOOKUP(F76,$B$11:$C$500,2,FALSE))","v":""}]
[{"$f":"IF('Incident Log'!C77=\"\",\"\",'Incident Log'!C77)","v":""},{"$f":"IFERROR(INDEX($A$11:$A$500, MATCH(0, COUNTIF($B$10:B76, $A$11:$A$500), 0)),\"\")","v":""},{"$f":"IF(B77=\"\",\"\",COUNTIF('Incident Log'!$C$11:$C$500,B77))","v":""},{"$f":"IF(B77=\"\",\"\",RANK(C77,$C$11:$C$500)+COUNTIF($C$11:C77,C77)-1)","v":""},"","",""]
[{"$f":"IF('Incident Log'!C78=\"\",\"\",'Incident Log'!C78)","v":""},{"$f":"IFERROR(INDEX($A$11:$A$500, MATCH(0, COUNTIF($B$10:B77, $A$11:$A$500), 0)),\"\")","v":""},{"$f":"IF(B78=\"\",\"\",COUNTIF('Incident Log'!$C$11:$C$500,B78))","v":""},{"$f":"IF(B78=\"\",\"\",RANK(C78,$C$11:$C$500)+COUNTIF($C$11:C78,C78)-1)","v":""},{"$f":"IF(B78=\"\",\"\",1+E77)","v":""},"",""]
[{"$f":"IF('Incident Log'!C79=\"\",\"\",'Incident Log'!C79)","v":""},{"$f":"IFERROR(INDEX($A$11:$A$500, MATCH(0, COUNTIF($B$10:B78, $A$11:$A$500), 0)),\"\")","v":""},{"$f":"IF(B79=\"\",\"\",COUNTIF('Incident Log'!$C$11:$C$500,B79))","v":""},{"$f":"IF(B79=\"\",\"\",RANK(C79,$C$11:$C$500)+COUNTIF($C$11:C79,C79)-1)","v":""},"","",""]
[{"$f":"IF('Incident Log'!C80=\"\",\"\",'Incident Log'!C80)","v":""},{"$f":"IFERROR(INDEX($A$11:$A$500, MATCH(0, COUNTIF($B$10:B79, $A$11:$A$500), 0)),\"\")","v":""},{"$f":"IF(B80=\"\",\"\",COUNTIF('Incident Log'!$C$11:$C$500,B80))","v":""},{"$f":"IF(B80=\"\",\"\",RANK(C80,$C$11:$C$500)+COUNTIF($C$11:C80,C80)-1)","v":""},"","",""]
[{"$f":"IF('Incident Log'!C81=\"\",\"\",'Incident Log'!C81)","v":""},{"$f":"IFERROR(INDEX($A$11:$A$500, MATCH(0, COUNTIF($B$10:B80, $A$11:$A$500), 0)),\"\")","v":""},{"$f":"IF(B81=\"\",\"\",COUNTIF('Incident Log'!$C$11:$C$500,B81))","v":""},{"$f":"IF(B81=\"\",\"\",RANK(C81,$C$11:$C$500)+COUNTIF($C$11:C81,C81)-1)","v":""},"","",""]
[{"$f":"IF('Incident Log'!C82=\"\",\"\",'Incident Log'!C82)","v":""},{"$f":"IFERROR(INDEX($A$11:$A$500, MATCH(0, COUNTIF($B$10:B81, $A$11:$A$500), 0)),\"\")","v":""},{"$f":"IF(B82=\"\",\"\",COUNTIF('Incident Log'!$C$11:$C$500,B82))","v":""},{"$f":"IF(B82=\"\",\"\",RANK(C82,$C$11:$C$500)+COUNTIF($C$11:C82,C82)-1)","v":""},"","",""]
[{"$f":"IF('Incident Log'!C83=\"\",\"\",'Incident Log'!C83)","v":""},{"$f":"IFERROR(INDEX($A$11:$A$500, MATCH(0, COUNTIF($B$10:B82, $A$11:$A$500), 0)),\"\")","v":""},{"$f":"IF(B83=\"\",\"\",COUNTIF('Incident Log'!$C$11:$C$500,B83))","v":""},{"$f":"IF(B83=\"\",\"\",RANK(C83,$C$11:$C$500)+COUNTIF($C$11:C83,C83)-1)","v":""},"","",""]
[{"$f":"IF('Incident Log'!C84=\"\",\"\",'Incident Log'!C84)","v":""},{"$f":"IFERROR(INDEX($A$11:$A$500, MATCH(0, COUNTIF($B$10:B83, $A$11:$A$500), 0)),\"\")","v":""},{"$f":"IF(B84=\"\",\"\",COUNTIF('Incident Log'!$C$11:$C$500,B84))","v":""},{"$f":"IF(B84=\"\",\"\",RANK(C84,$C$11:$C$500)+COUNTIF($C$11:C84,C84)-1)","v":""},"","",""]
[{"$f":"IF('Incident Log'!C85=\"\",\"\",'Incident Log'!C85)","v":""},{"$f":"IFERROR(INDEX($A$11:$A$500, MATCH(0, COUNTIF($B$10:B84, $A$11:$A$500), 0)),\"\")","v":""},{"$f":"IF(B85=\"\",\"\",COUNTIF('Incident Log'!$C$11:$C$500,B85))","v":""},{"$f":"IF(B85=\"\",\"\",RANK(C85,$C$11:$C$500)+COUNTIF($C$11:C85,C85)-1)","v":""},"","",""]
[{"$f":"IF('Incident Log'!C86=\"\",\"\",'Incident Log'!C86)","v":""},{"$f":"IFERROR(INDEX($A$11:$A$500, MATCH(0, COUNTIF($B$10:B85, $A$11:$A$500), 0)),\"\")","v":""},{"$f":"IF(B86=\"\",\"\",COUNTIF('Incident Log'!$C$11:$C$500,B86))","v":""},{"$f":"IF(B86=\"\",\"\",RANK(C86,$C$11:$C$500)+COUNTIF($C$11:C86,C86)-1)","v":""},"","",""]
[{"$f":"IF('Incident Log'!C87=\"\",\"\",'Incident Log'!C87)","v":""},{"$f":"IFERROR(INDEX($A$11:$A$500, MATCH(0, COUNTIF($B$10:B86, $A$11:$A$500), 0)),\"\")","v":""},{"$f":"IF(B87=\"\",\"\",COUNTIF('Incident Log'!$C$11:$C$500,B87))","v":""},{"$f":"IF(B87=\"\",\"\",RANK(C87,$C$11:$C$500)+COUNTIF($C$11:C87,C87)-1)","v":""},"","",""]
[{"$f":"IF('Incident Log'!C88=\"\",\"\",'Incident Log'!C88)","v":""},{"$f":"IFERROR(INDEX($A$11:$A$500, MATCH(0, COUNTIF($B$10:B87, $A$11:$A$500), 0)),\"\")","v":""},{"$f":"IF(B88=\"\",\"\",COUNTIF('Incident Log'!$C$11:$C$500,B88))","v":""},{"$f":"IF(B88=\"\",\"\",RANK(C88,$C$11:$C$500)+COUNTIF($C$11:C88,C88)-1)","v":""},"","",""]
[{"$f":"IF('Incident Log'!C89=\"\",\"\",'Incident Log'!C89)","v":""},{"$f":"IFERROR(INDEX($A$11:$A$500, MATCH(0, COUNTIF($B$10:B88, $A$11:$A$500), 0)),\"\")","v":""},{"$f":"IF(B89=\"\",\"\",COUNTIF('Incident Log'!$C$11:$C$500,B89))","v":""},{"$f":"IF(B89=\"\",\"\",RANK(C89,$C$11:$C$500)+COUNTIF($C$11:C89,C89)-1)","v":""},"","",""]
[{"$f":"IF('Incident Log'!C90=\"\",\"\",'Incident Log'!C90)","v":""},{"$f":"IFERROR(INDEX($A$11:$A$500, MATCH(0, COUNTIF($B$10:B89, $A$11:$A$500), 0)),\"\")","v":""},{"$f":"IF(B90=\"\",\"\",COUNTIF('Incident Log'!$C$11:$C$500,B90))","v":""},{"$f":"IF(B90=\"\",\"\",RANK(C90,$C$11:$C$500)+COUNTIF($C$11:C90,C90)-1)","v":""},"","",""]
[{"$f":"IF('Incident Log'!C91=\"\",\"\",'Incident Log'!C91)","v":""},{"$f":"IFERROR(INDEX($A$11:$A$500, MATCH(0, COUNTIF($B$10:B90, $A$11:$A$500), 0)),\"\")","v":""},{"$f":"IF(B91=\"\",\"\",COUNTIF('Incident Log'!$C$11:$C$500,B91))","v":""},{"$f":"IF(B91=\"\",\"\",RANK(C91,$C$11:$C$500)+COUNTIF($C$11:C91,C91)-1)","v":""},"","",""]
[{"$f":"IF('Incident Log'!C92=\"\",\"\",'Incident Log'!C92)","v":""},{"$f":"IFERROR(INDEX($A$11:$A$500, MATCH(0, COUNTIF($B$10:B91, $A$11:$A$500), 0)),\"\")","v":""},{"$f":"IF(B92=\"\",\"\",COUNTIF('Incident Log'!$C$11:$C$500,B92))","v":""},{"$f":"IF(B92=\"\",\"\",RANK(C92,$C$11:$C$500)+COUNTIF($C$11:C92,C92)-1)","v":""},"","",""]
[{"$f":"IF('Incident Log'!C93=\"\",\"\",'Incident Log'!C93)","v":""},{"$f":"IFERROR(INDEX($A$11:$A$500, MATCH(0, COUNTIF($B$10:B92, $A$11:$A$500), 0)),\"\")","v":""},{"$f":"IF(B93=\"\",\"\",COUNTIF('Incident Log'!$C$11:$C$500,B93))","v":""},{"$f":"IF(B93=\"\",\"\",RANK(C93,$C$11:$C$500)+COUNTIF($C$11:C93,C93)-1)","v":""},"","",""]
[{"$f":"IF('Incident Log'!C94=\"\",\"\",'Incident Log'!C94)","v":""},{"$f":"IFERROR(INDEX($A$11:$A$500, MATCH(0, COUNTIF($B$10:B93, $A$11:$A$500), 0)),\"\")","v":""},{"$f":"IF(B94=\"\",\"\",COUNTIF('Incident Log'!$C$11:$C$500,B94))","v":""},{"$f":"IF(B94=\"\",\"\",RANK(C94,$C$11:$C$500)+COUNTIF($C$11:C94,C94)-1)","v":""},"","",""]
[{"$f":"IF('Incident Log'!C95=\"\",\"\",'Incident Log'!C95)","v":""},{"$f":"IFERROR(INDEX($A$11:$A$500, MATCH(0, COUNTIF($B$10:B94, $A$11:$A$500), 0)),\"\")","v":""},{"$f":"IF(B95=\"\",\"\",COUNTIF('Incident Log'!$C$11:$C$500,B95))","v":""},{"$f":"IF(B95=\"\",\"\",RANK(C95,$C$11:$C$500)+COUNTIF($C$11:C95,C95)-1)","v":""},"","",""]
[{"$f":"IF('Incident Log'!C96=\"\",\"\",'Incident Log'!C96)","v":""},{"$f":"IFERROR(INDEX($A$11:$A$500, MATCH(0, COUNTIF($B$10:B95, $A$11:$A$500), 0)),\"\")","v":""},{"$f":"IF(B96=\"\",\"\",COUNTIF('Incident Log'!$C$11:$C$500,B96))","v":""},{"$f":"IF(B96=\"\",\"\",RANK(C96,$C$11:$C$500)+COUNTIF($C$11:C96,C96)-1)","v":""},"","",""]
[{"$f":"IF('Incident Log'!C97=\"\",\"\",'Incident Log'!C97)","v":""},{"$f":"IFERROR(INDEX($A$11:$A$500, MATCH(0, COUNTIF($B$10:B96, $A$11:$A$500), 0)),\"\")","v":""},{"$f":"IF(B97=\"\",\"\",COUNTIF('Incident Log'!$C$11:$C$500,B97))","v":""},{"$f":"IF(B97=\"\",\"\",RANK(C97,$C$11:$C$500)+COUNTIF($C$11:C97,C97)-1)","v":""},"","",""]
[{"$f":"IF('Incident Log'!C98=\"\",\"\",'Incident Log'!C98)","v":""},{"$f":"IFERROR(INDEX($A$11:$A$500, MATCH(0, COUNTIF($B$10:B97, $A$11:$A$500), 0)),\"\")","v":""},{"$f":"IF(B98=\"\",\"\",COUNTIF('Incident Log'!$C$11:$C$500,B98))","v":""},{"$f":"IF(B98=\"\",\"\",RANK(C98,$C$11:$C$500)+COUNTIF($C$11:C98,C98)-1)","v":""},"","",""]
[{"$f":"IF('Incident Log'!C99=\"\",\"\",'Incident Log'!C99)","v":""},{"$f":"IFERROR(INDEX($A$11:$A$500, MATCH(0, COUNTIF($B$10:B98, $A$11:$A$500), 0)),\"\")","v":""},{"$f":"IF(B99=\"\",\"\",COUNTIF('Incident Log'!$C$11:$C$500,B99))","v":""},{"$f":"IF(B99=\"\",\"\",RANK(C99,$C$11:$C$500)+COUNTIF($C$11:C99,C99)-1)","v":""},"","",""]
[{"$f":"IF('Incident Log'!C100=\"\",\"\",'Incident Log'!C100)","v":""},{"$f":"IFERROR(INDEX($A$11:$A$500, MATCH(0, COUNTIF($B$10:B99, $A$11:$A$500), 0)),\"\")","v":""},{"$f":"IF(B100=\"\",\"\",COUNTIF('Incident Log'!$C$11:$C$500,B100))","v":""},{"$f":"IF(B100=\"\",\"\",RANK(C100,$C$11:$C$500)+COUNTIF($C$11:C100,C100)-1)","v":""},"","",""]
[{"$f":"IF('Incident Log'!C101=\"\",\"\",'Incident Log'!C101)","v":""},{"$f":"IFERROR(INDEX($A$11:$A$500, MATCH(0, COUNTIF($B$10:B100, $A$11:$A$500), 0)),\"\")","v":""},{"$f":"IF(B101=\"\",\"\",COUNTIF('Incident Log'!$C$11:$C$500,B101))","v":""},{"$f":"IF(B101=\"\",\"\",RANK(C101,$C$11:$C$500)+COUNTIF($C$11:C101,C101)-1)","v":""},"","",""]
[{"$f":"IF('Incident Log'!C102=\"\",\"\",'Incident Log'!C102)","v":""},{"$f":"IFERROR(INDEX($A$11:$A$500, MATCH(0, COUNTIF($B$10:B101, $A$11:$A$500), 0)),\"\")","v":""},{"$f":"IF(B102=\"\",\"\",COUNTIF('Incident Log'!$C$11:$C$500,B102))","v":""},{"$f":"IF(B102=\"\",\"\",RANK(C102,$C$11:$C$500)+COUNTIF($C$11:C102,C102)-1)","v":""},"","",""]
[{"$f":"IF('Incident Log'!C103=\"\",\"\",'Incident Log'!C103)","v":""},{"$f":"IFERROR(INDEX($A$11:$A$500, MATCH(0, COUNTIF($B$10:B102, $A$11:$A$500), 0)),\"\")","v":""},{"$f":"IF(B103=\"\",\"\",COUNTIF('Incident Log'!$C$11:$C$500,B103))","v":""},{"$f":"IF(B103=\"\",\"\",RANK(C103,$C$11:$C$500)+COUNTIF($C$11:C103,C103)-1)","v":""},"","",""]
[{"$f":"IF('Incident Log'!C104=\"\",\"\",'Incident Log'!C104)","v":""},{"$f":"IFERROR(INDEX($A$11:$A$500, MATCH(0, COUNTIF($B$10:B103, $A$11:$A$500), 0)),\"\")","v":""},{"$f":"IF(B104=\"\",\"\",COUNTIF('Incident Log'!$C$11:$C$500,B104))","v":""},{"$f":"IF(B104=\"\",\"\",RANK(C104,$C$11:$C$500)+COUNTIF($C$11:C104,C104)-1)","v":""},"","",""]
[{"$f":"IF('Incident Log'!C105=\"\",\"\",'Incident Log'!C105)","v":""},{"$f":"IFERROR(INDEX($A$11:$A$500, MATCH(0, COUNTIF($B$10:B104, $A$11:$A$500), 0)),\"\")","v":""},{"$f":"IF(B105=\"\",\"\",COUNTIF('Incident Log'!$C$11:$C$500,B105))","v":""},{"$f":"IF(B105=\"\",\"\",RANK(C105,$C$11:$C$500)+COUNTIF($C$11:C105,C105)-1)","v":""},"","",""]
[{"$f":"IF('Incident Log'!C106=\"\",\"\",'Incident Log'!C106)","v":""},{"$f":"IFERROR(INDEX($A$11:$A$500, MATCH(0, COUNTIF($B$10:B105, $A$11:$A$500), 0)),\"\")","v":""},{"$f":"IF(B106=\"\",\"\",COUNTIF('Incident Log'!$C$11:$C$500,B106))","v":""},{"$f":"IF(B106=\"\",\"\",RANK(C106,$C$11:$C$500)+COUNTIF($C$11:C106,C106)-1)","v":""},"","",""]
[{"$f":"IF('Incident Log'!C107=\"\",\"\",'Incident Log'!C107)","v":""},{"$f":"IFERROR(INDEX($A$11:$A$500, MATCH(0, COUNTIF($B$10:B106, $A$11:$A$500), 0)),\"\")","v":""},{"$f":"IF(B107=\"\",\"\",COUNTIF('Incident Log'!$C$11:$C$500,B107))","v":""},{"$f":"IF(B107=\"\",\"\",RANK(C107,$C$11:$C$500)+COUNTIF($C$11:C107,C107)-1)","v":""},"","",""]
[{"$f":"IF('Incident Log'!C108=\"\",\"\",'Incident Log'!C108)","v":""},{"$f":"IFERROR(INDEX($A$11:$A$500, MATCH(0, COUNTIF($B$10:B107, $A$11:$A$500), 0)),\"\")","v":""},{"$f":"IF(B108=\"\",\"\",COUNTIF('Incident Log'!$C$11:$C$500,B108))","v":""},{"$f":"IF(B108=\"\",\"\",RANK(C108,$C$11:$C$500)+COUNTIF($C$11:C108,C108)-1)","v":""},"","",""]
[{"$f":"IF('Incident Log'!C109=\"\",\"\",'Incident Log'!C109)","v":""},{"$f":"IFERROR(INDEX($A$11:$A$500, MATCH(0, COUNTIF($B$10:B108, $A$11:$A$500), 0)),\"\")","v":""},{"$f":"IF(B109=\"\",\"\",COUNTIF('Incident Log'!$C$11:$C$500,B109))","v":""},{"$f":"IF(B109=\"\",\"\",RANK(C109,$C$11:$C$500)+COUNTIF($C$11:C109,C109)-1)","v":""},"","",""]
[{"$f":"IF('Incident Log'!C110=\"\",\"\",'Incident Log'!C110)","v":""},{"$f":"IFERROR(INDEX($A$11:$A$500, MATCH(0, COUNTIF($B$10:B109, $A$11:$A$500), 0)),\"\")","v":""},{"$f":"IF(B110=\"\",\"\",COUNTIF('Incident Log'!$C$11:$C$500,B110))","v":""},{"$f":"IF(B110=\"\",\"\",RANK(C110,$C$11:$C$500)+COUNTIF($C$11:C110,C110)-1)","v":""},"","",""]
[{"$f":"IF('Incident Log'!C111=\"\",\"\",'Incident Log'!C111)","v":""},{"$f":"IFERROR(INDEX($A$11:$A$500, MATCH(0, COUNTIF($B$10:B110, $A$11:$A$500), 0)),\"\")","v":""},{"$f":"IF(B111=\"\",\"\",COUNTIF('Incident Log'!$C$11:$C$500,B111))","v":""},{"$f":"IF(B111=\"\",\"\",RANK(C111,$C$11:$C$500)+COUNTIF($C$11:C111,C111)-1)","v":""},"","",""]
[{"$f":"IF('Incident Log'!C112=\"\",\"\",'Incident Log'!C112)","v":""},{"$f":"IFERROR(INDEX($A$11:$A$500, MATCH(0, COUNTIF($B$10:B111, $A$11:$A$500), 0)),\"\")","v":""},{"$f":"IF(B112=\"\",\"\",COUNTIF('Incident Log'!$C$11:$C$500,B112))","v":""},{"$f":"IF(B112=\"\",\"\",RANK(C112,$C$11:$C$500)+COUNTIF($C$11:C112,C112)-1)","v":""},"","",""]
[{"$f":"IF('Incident Log'!C113=\"\",\"\",'Incident Log'!C113)","v":""},{"$f":"IFERROR(INDEX($A$11:$A$500, MATCH(0, COUNTIF($B$10:B112, $A$11:$A$500), 0)),\"\")","v":""},{"$f":"IF(B113=\"\",\"\",COUNTIF('Incident Log'!$C$11:$C$500,B113))","v":""},{"$f":"IF(B113=\"\",\"\",RANK(C113,$C$11:$C$500)+COUNTIF($C$11:C113,C113)-1)","v":""},"","",""]
[{"$f":"IF('Incident Log'!C114=\"\",\"\",'Incident Log'!C114)","v":""},{"$f":"IFERROR(INDEX($A$11:$A$500, MATCH(0, COUNTIF($B$10:B113, $A$11:$A$500), 0)),\"\")","v":""},{"$f":"IF(B114=\"\",\"\",COUNTIF('Incident Log'!$C$11:$C$500,B114))","v":""},{"$f":"IF(B114=\"\",\"\",RANK(C114,$C$11:$C$500)+COUNTIF($C$11:C114,C114)-1)","v":""},"","",""]
[{"$f":"IF('Incident Log'!C115=\"\",\"\",'Incident Log'!C115)","v":""},{"$f":"IFERROR(INDEX($A$11:$A$500, MATCH(0, COUNTIF($B$10:B114, $A$11:$A$500), 0)),\"\")","v":""},{"$f":"IF(B115=\"\",\"\",COUNTIF('Incident Log'!$C$11:$C$500,B115))","v":""},{"$f":"IF(B115=\"\",\"\",RANK(C115,$C$11:$C$500)+COUNTIF($C$11:C115,C115)-1)","v":""},"","",""]
[{"$f":"IF('Incident Log'!C116=\"\",\"\",'Incident Log'!C116)","v":""},{"$f":"IFERROR(INDEX($A$11:$A$500, MATCH(0, COUNTIF($B$10:B115, $A$11:$A$500), 0)),\"\")","v":""},{"$f":"IF(B116=\"\",\"\",COUNTIF('Incident Log'!$C$11:$C$500,B116))","v":""},{"$f":"IF(B116=\"\",\"\",RANK(C116,$C$11:$C$500)+COUNTIF($C$11:C116,C116)-1)","v":""},"","",""]
[{"$f":"IF('Incident Log'!C117=\"\",\"\",'Incident Log'!C117)","v":""},{"$f":"IFERROR(INDEX($A$11:$A$500, MATCH(0, COUNTIF($B$10:B116, $A$11:$A$500), 0)),\"\")","v":""},{"$f":"IF(B117=\"\",\"\",COUNTIF('Incident Log'!$C$11:$C$500,B117))","v":""},{"$f":"IF(B117=\"\",\"\",RANK(C117,$C$11:$C$500)+COUNTIF($C$11:C117,C117)-1)","v":""},"","",""]
[{"$f":"IF('Incident Log'!C118=\"\",\"\",'Incident Log'!C118)","v":""},{"$f":"IFERROR(INDEX($A$11:$A$500, MATCH(0, COUNTIF($B$10:B117, $A$11:$A$500), 0)),\"\")","v":""},{"$f":"IF(B118=\"\",\"\",COUNTIF('Incident Log'!$C$11:$C$500,B118))","v":""},{"$f":"IF(B118=\"\",\"\",RANK(C118,$C$11:$C$500)+COUNTIF($C$11:C118,C118)-1)","v":""},"","",""]
[{"$f":"IF('Incident Log'!C119=\"\",\"\",'Incident Log'!C119)","v":""},{"$f":"IFERROR(INDEX($A$11:$A$500, MATCH(0, COUNTIF($B$10:B118, $A$11:$A$500), 0)),\"\")","v":""},{"$f":"IF(B119=\"\",\"\",COUNTIF('Incident Log'!$C$11:$C$500,B119))","v":""},{"$f":"IF(B119=\"\",\"\",RANK(C119,$C$11:$C$500)+COUNTIF($C$11:C119,C119)-1)","v":""},"","",""]
[{"$f":"IF('Incident Log'!C120=\"\",\"\",'Incident Log'!C120)","v":""},{"$f":"IFERROR(INDEX($A$11:$A$500, MATCH(0, COUNTIF($B$10:B119, $A$11:$A$500), 0)),\"\")","v":""},{"$f":"IF(B120=\"\",\"\",COUNTIF('Incident Log'!$C$11:$C$500,B120))","v":""},{"$f":"IF(B120=\"\",\"\",RANK(C120,$C$11:$C$500)+COUNTIF($C$11:C120,C120)-1)","v":""},"","",""]
[{"$f":"IF('Incident Log'!C121=\"\",\"\",'Incident Log'!C121)","v":""},{"$f":"IFERROR(INDEX($A$11:$A$500, MATCH(0, COUNTIF($B$10:B120, $A$11:$A$500), 0)),\"\")","v":""},{"$f":"IF(B121=\"\",\"\",COUNTIF('Incident Log'!$C$11:$C$500,B121))","v":""},{"$f":"IF(B121=\"\",\"\",RANK(C121,$C$11:$C$500)+COUNTIF($C$11:C121,C121)-1)","v":""},"","",""]
[{"$f":"IF('Incident Log'!C122=\"\",\"\",'Incident Log'!C122)","v":""},{"$f":"IFERROR(INDEX($A$11:$A$500, MATCH(0, COUNTIF($B$10:B121, $A$11:$A$500), 0)),\"\")","v":""},{"$f":"IF(B122=\"\",\"\",COUNTIF('Incident Log'!$C$11:$C$500,B122))","v":""},{"$f":"IF(B122=\"\",\"\",RANK(C122,$C$11:$C$500)+COUNTIF($C$11:C122,C122)-1)","v":""},"","",""]
[{"$f":"IF('Incident Log'!C123=\"\",\"\",'Incident Log'!C123)","v":""},{"$f":"IFERROR(INDEX($A$11:$A$500, MATCH(0, COUNTIF($B$10:B122, $A$11:$A$500), 0)),\"\")","v":""},{"$f":"IF(B123=\"\",\"\",COUNTIF('Incident Log'!$C$11:$C$500,B123))","v":""},{"$f":"IF(B123=\"\",\"\",RANK(C123,$C$11:$C$500)+COUNTIF($C$11:C123,C123)-1)","v":""},"","",""]
[{"$f":"IF('Incident Log'!C124=\"\",\"\",'Incident Log'!C124)","v":""},{"$f":"IFERROR(INDEX($A$11:$A$500, MATCH(0, COUNTIF($B$10:B123, $A$11:$A$500), 0)),\"\")","v":""},{"$f":"IF(B124=\"\",\"\",COUNTIF('Incident Log'!$C$11:$C$500,B124))","v":""},{"$f":"IF(B124=\"\",\"\",RANK(C124,$C$11:$C$500)+COUNTIF($C$11:C124,C124)-1)","v":""},"","",""]
[{"$f":"IF('Incident Log'!C125=\"\",\"\",'Incident Log'!C125)","v":""},{"$f":"IFERROR(INDEX($A$11:$A$500, MATCH(0, COUNTIF($B$10:B124, $A$11:$A$500), 0)),\"\")","v":""},{"$f":"IF(B125=\"\",\"\",COUNTIF('Incident Log'!$C$11:$C$500,B125))","v":""},{"$f":"IF(B125=\"\",\"\",RANK(C125,$C$11:$C$500)+COUNTIF($C$11:C125,C125)-1)","v":""},"","",""]
[{"$f":"IF('Incident Log'!C126=\"\",\"\",'Incident Log'!C126)","v":""},{"$f":"IFERROR(INDEX($A$11:$A$500, MATCH(0, COUNTIF($B$10:B125, $A$11:$A$500), 0)),\"\")","v":""},{"$f":"IF(B126=\"\",\"\",COUNTIF('Incident Log'!$C$11:$C$500,B126))","v":""},{"$f":"IF(B126=\"\",\"\",RANK(C126,$C$11:$C$500)+COUNTIF($C$11:C126,C126)-1)","v":""},"","",""]
[{"$f":"IF('Incident Log'!C127=\"\",\"\",'Incident Log'!C127)","v":""},{"$f":"IFERROR(INDEX($A$11:$A$500, MATCH(0, COUNTIF($B$10:B126, $A$11:$A$500), 0)),\"\")","v":""},{"$f":"IF(B127=\"\",\"\",COUNTIF('Incident Log'!$C$11:$C$500,B127))","v":""},{"$f":"IF(B127=\"\",\"\",RANK(C127,$C$11:$C$500)+COUNTIF($C$11:C127,C127)-1)","v":""},"","",""]
[{"$f":"IF('Incident Log'!C128=\"\",\"\",'Incident Log'!C128)","v":""},{"$f":"IFERROR(INDEX($A$11:$A$500, MATCH(0, COUNTIF($B$10:B127, $A$11:$A$500), 0)),\"\")","v":""},{"$f":"IF(B128=\"\",\"\",COUNTIF('Incident Log'!$C$11:$C$500,B128))","v":""},{"$f":"IF(B128=\"\",\"\",RANK(C128,$C$11:$C$500)+COUNTIF($C$11:C128,C128)-1)","v":""},"","",""]
[{"$f":"IF('Incident Log'!C129=\"\",\"\",'Incident Log'!C129)","v":""},{"$f":"IFERROR(INDEX($A$11:$A$500, MATCH(0, COUNTIF($B$10:B128, $A$11:$A$500), 0)),\"\")","v":""},{"$f":"IF(B129=\"\",\"\",COUNTIF('Incident Log'!$C$11:$C$500,B129))","v":""},{"$f":"IF(B129=\"\",\"\",RANK(C129,$C$11:$C$500)+COUNTIF($C$11:C129,C129)-1)","v":""},"","",""]
[{"$f":"IF('Incident Log'!C130=\"\",\"\",'Incident Log'!C130)","v":""},{"$f":"IFERROR(INDEX($A$11:$A$500, MATCH(0, COUNTIF($B$10:B129, $A$11:$A$500), 0)),\"\")","v":""},{"$f":"IF(B130=\"\",\"\",COUNTIF('Incident Log'!$C$11:$C$500,B130))","v":""},{"$f":"IF(B130=\"\",\"\",RANK(C130,$C$11:$C$500)+COUNTIF($C$11:C130,C130)-1)","v":""},"","",""]
[{"$f":"IF('Incident Log'!C131=\"\",\"\",'Incident Log'!C131)","v":""},{"$f":"IFERROR(INDEX($A$11:$A$500, MATCH(0, COUNTIF($B$10:B130, $A$11:$A$500), 0)),\"\")","v":""},{"$f":"IF(B131=\"\",\"\",COUNTIF('Incident Log'!$C$11:$C$500,B131))","v":""},{"$f":"IF(B131=\"\",\"\",RANK(C131,$C$11:$C$500)+COUNTIF($C$11:C131,C131)-1)","v":""},"","",""]
[{"$f":"IF('Incident Log'!C132=\"\",\"\",'Incident Log'!C132)","v":""},{"$f":"IFERROR(INDEX($A$11:$A$500, MATCH(0, COUNTIF($B$10:B131, $A$11:$A$500), 0)),\"\")","v":""},{"$f":"IF(B132=\"\",\"\",COUNTIF('Incident Log'!$C$11:$C$500,B132))","v":""},{"$f":"IF(B132=\"\",\"\",RANK(C132,$C$11:$C$500)+COUNTIF($C$11:C132,C132)-1)","v":""},"","",""]
[{"$f":"IF('Incident Log'!C133=\"\",\"\",'Incident Log'!C133)","v":""},{"$f":"IFERROR(INDEX($A$11:$A$500, MATCH(0, COUNTIF($B$10:B132, $A$11:$A$500), 0)),\"\")","v":""},{"$f":"IF(B133=\"\",\"\",COUNTIF('Incident Log'!$C$11:$C$500,B133))","v":""},{"$f":"IF(B133=\"\",\"\",RANK(C133,$C$11:$C$500)+COUNTIF($C$11:C133,C133)-1)","v":""},"","",""]
[{"$f":"IF('Incident Log'!C134=\"\",\"\",'Incident Log'!C134)","v":""},{"$f":"IFERROR(INDEX($A$11:$A$500, MATCH(0, COUNTIF($B$10:B133, $A$11:$A$500), 0)),\"\")","v":""},{"$f":"IF(B134=\"\",\"\",COUNTIF('Incident Log'!$C$11:$C$500,B134))","v":""},{"$f":"IF(B134=\"\",\"\",RANK(C134,$C$11:$C$500)+COUNTIF($C$11:C134,C134)-1)","v":""},"","",""]
[{"$f":"IF('Incident Log'!C135=\"\",\"\",'Incident Log'!C135)","v":""},{"$f":"IFERROR(INDEX($A$11:$A$500, MATCH(0, COUNTIF($B$10:B134, $A$11:$A$500), 0)),\"\")","v":""},{"$f":"IF(B135=\"\",\"\",COUNTIF('Incident Log'!$C$11:$C$500,B135))","v":""},{"$f":"IF(B135=\"\",\"\",RANK(C135,$C$11:$C$500)+COUNTIF($C$11:C135,C135)-1)","v":""},"","",""]
[{"$f":"IF('Incident Log'!C136=\"\",\"\",'Incident Log'!C136)","v":""},{"$f":"IFERROR(INDEX($A$11:$A$500, MATCH(0, COUNTIF($B$10:B135, $A$11:$A$500), 0)),\"\")","v":""},{"$f":"IF(B136=\"\",\"\",COUNTIF('Incident Log'!$C$11:$C$500,B136))","v":""},{"$f":"IF(B136=\"\",\"\",RANK(C136,$C$11:$C$500)+COUNTIF($C$11:C136,C136)-1)","v":""},"","",""]
[{"$f":"IF('Incident Log'!C137=\"\",\"\",'Incident Log'!C137)","v":""},{"$f":"IFERROR(INDEX($A$11:$A$500, MATCH(0, COUNTIF($B$10:B136, $A$11:$A$500), 0)),\"\")","v":""},{"$f":"IF(B137=\"\",\"\",COUNTIF('Incident Log'!$C$11:$C$500,B137))","v":""},{"$f":"IF(B137=\"\",\"\",RANK(C137,$C$11:$C$500)+COUNTIF($C$11:C137,C137)-1)","v":""},"","",""]
[{"$f":"IF('Incident Log'!C138=\"\",\"\",'Incident Log'!C138)","v":""},{"$f":"IFERROR(INDEX($A$11:$A$500, MATCH(0, COUNTIF($B$10:B137, $A$11:$A$500), 0)),\"\")","v":""},{"$f":"IF(B138=\"\",\"\",COUNTIF('Incident Log'!$C$11:$C$500,B138))","v":""},{"$f":"IF(B138=\"\",\"\",RANK(C138,$C$11:$C$500)+COUNTIF($C$11:C138,C138)-1)","v":""},"","",""]
[{"$f":"IF('Incident Log'!C139=\"\",\"\",'Incident Log'!C139)","v":""},{"$f":"IFERROR(INDEX($A$11:$A$500, MATCH(0, COUNTIF($B$10:B138, $A$11:$A$500), 0)),\"\")","v":""},{"$f":"IF(B139=\"\",\"\",COUNTIF('Incident Log'!$C$11:$C$500,B139))","v":""},{"$f":"IF(B139=\"\",\"\",RANK(C139,$C$11:$C$500)+COUNTIF($C$11:C139,C139)-1)","v":""},"","",""]
[{"$f":"IF('Incident Log'!C140=\"\",\"\",'Incident Log'!C140)","v":""},{"$f":"IFERROR(INDEX($A$11:$A$500, MATCH(0, COUNTIF($B$10:B139, $A$11:$A$500), 0)),\"\")","v":""},{"$f":"IF(B140=\"\",\"\",COUNTIF('Incident Log'!$C$11:$C$500,B140))","v":""},{"$f":"IF(B140=\"\",\"\",RANK(C140,$C$11:$C$500)+COUNTIF($C$11:C140,C140)-1)","v":""},"",{"$f":"IF(B140=\"\",\"\",INDEX($B$11:$B$500,MATCH(E140,$D$11:$D$500,0)))","v":""},{"$f":"IF(B140=\"\",\"\",VLOOKUP(F140,$B$11:$C$500,2,FALSE))","v":""}]
[{"$f":"IF('Incident Log'!C141=\"\",\"\",'Incident Log'!C141)","v":""},{"$f":"IFERROR(INDEX($A$11:$A$500, MATCH(0, COUNTIF($B$10:B140, $A$11:$A$500), 0)),\"\")","v":""},{"$f":"IF(B141=\"\",\"\",COUNTIF('Incident Log'!$C$11:$C$500,B141))","v":""},{"$f":"IF(B141=\"\",\"\",RANK(C141,$C$11:$C$500)+COUNTIF($C$11:C141,C141)-1)","v":""},"","",""]
[{"$f":"IF('Incident Log'!C142=\"\",\"\",'Incident Log'!C142)","v":""},{"$f":"IFERROR(INDEX($A$11:$A$500, MATCH(0, COUNTIF($B$10:B141, $A$11:$A$500), 0)),\"\")","v":""},{"$f":"IF(B142=\"\",\"\",COUNTIF('Incident Log'!$C$11:$C$500,B142))","v":""},{"$f":"IF(B142=\"\",\"\",RANK(C142,$C$11:$C$500)+COUNTIF($C$11:C142,C142)-1)","v":""},{"$f":"IF(B142=\"\",\"\",1+E141)","v":""},"",""]
[{"$f":"IF('Incident Log'!C143=\"\",\"\",'Incident Log'!C143)","v":""},{"$f":"IFERROR(INDEX($A$11:$A$500, MATCH(0, COUNTIF($B$10:B142, $A$11:$A$500), 0)),\"\")","v":""},{"$f":"IF(B143=\"\",\"\",COUNTIF('Incident Log'!$C$11:$C$500,B143))","v":""},{"$f":"IF(B143=\"\",\"\",RANK(C143,$C$11:$C$500)+COUNTIF($C$11:C143,C143)-1)","v":""},"","",""]
[{"$f":"IF('Incident Log'!C144=\"\",\"\",'Incident Log'!C144)","v":""},{"$f":"IFERROR(INDEX($A$11:$A$500, MATCH(0, COUNTIF($B$10:B143, $A$11:$A$500), 0)),\"\")","v":""},{"$f":"IF(B144=\"\",\"\",COUNTIF('Incident Log'!$C$11:$C$500,B144))","v":""},{"$f":"IF(B144=\"\",\"\",RANK(C144,$C$11:$C$500)+COUNTIF($C$11:C144,C144)-1)","v":""},"","",""]
[{"$f":"IF('Incident Log'!C145=\"\",\"\",'Incident Log'!C145)","v":""},{"$f":"IFERROR(INDEX($A$11:$A$500, MATCH(0, COUNTIF($B$10:B144, $A$11:$A$500), 0)),\"\")","v":""},{"$f":"IF(B145=\"\",\"\",COUNTIF('Incident Log'!$C$11:$C$500,B145))","v":""},{"$f":"IF(B145=\"\",\"\",RANK(C145,$C$11:$C$500)+COUNTIF($C$11:C145,C145)-1)","v":""},"","",""]
[{"$f":"IF('Incident Log'!C146=\"\",\"\",'Incident Log'!C146)","v":""},{"$f":"IFERROR(INDEX($A$11:$A$500, MATCH(0, COUNTIF($B$10:B145, $A$11:$A$500), 0)),\"\")","v":""},{"$f":"IF(B146=\"\",\"\",COUNTIF('Incident Log'!$C$11:$C$500,B146))","v":""},{"$f":"IF(B146=\"\",\"\",RANK(C146,$C$11:$C$500)+COUNTIF($C$11:C146,C146)-1)","v":""},"","",""]
[{"$f":"IF('Incident Log'!C147=\"\",\"\",'Incident Log'!C147)","v":""},{"$f":"IFERROR(INDEX($A$11:$A$500, MATCH(0, COUNTIF($B$10:B146, $A$11:$A$500), 0)),\"\")","v":""},{"$f":"IF(B147=\"\",\"\",COUNTIF('Incident Log'!$C$11:$C$500,B147))","v":""},{"$f":"IF(B147=\"\",\"\",RANK(C147,$C$11:$C$500)+COUNTIF($C$11:C147,C147)-1)","v":""},"","",""]
[{"$f":"IF('Incident Log'!C148=\"\",\"\",'Incident Log'!C148)","v":""},{"$f":"IFERROR(INDEX($A$11:$A$500, MATCH(0, COUNTIF($B$10:B147, $A$11:$A$500), 0)),\"\")","v":""},{"$f":"IF(B148=\"\",\"\",COUNTIF('Incident Log'!$C$11:$C$500,B148))","v":""},{"$f":"IF(B148=\"\",\"\",RANK(C148,$C$11:$C$500)+COUNTIF($C$11:C148,C148)-1)","v":""},"","",""]
[{"$f":"IF('Incident Log'!C149=\"\",\"\",'Incident Log'!C149)","v":""},{"$f":"IFERROR(INDEX($A$11:$A$500, MATCH(0, COUNTIF($B$10:B148, $A$11:$A$500), 0)),\"\")","v":""},{"$f":"IF(B149=\"\",\"\",COUNTIF('Incident Log'!$C$11:$C$500,B149))","v":""},{"$f":"IF(B149=\"\",\"\",RANK(C149,$C$11:$C$500)+COUNTIF($C$11:C149,C149)-1)","v":""},"","",""]
[{"$f":"IF('Incident Log'!C150=\"\",\"\",'Incident Log'!C150)","v":""},{"$f":"IFERROR(INDEX($A$11:$A$500, MATCH(0, COUNTIF($B$10:B149, $A$11:$A$500), 0)),\"\")","v":""},{"$f":"IF(B150=\"\",\"\",COUNTIF('Incident Log'!$C$11:$C$500,B150))","v":""},{"$f":"IF(B150=\"\",\"\",RANK(C150,$C$11:$C$500)+COUNTIF($C$11:C150,C150)-1)","v":""},"","",""]
[{"$f":"IF('Incident Log'!C151=\"\",\"\",'Incident Log'!C151)","v":""},{"$f":"IFERROR(INDEX($A$11:$A$500, MATCH(0, COUNTIF($B$10:B150, $A$11:$A$500), 0)),\"\")","v":""},{"$f":"IF(B151=\"\",\"\",COUNTIF('Incident Log'!$C$11:$C$500,B151))","v":""},{"$f":"IF(B151=\"\",\"\",RANK(C151,$C$11:$C$500)+COUNTIF($C$11:C151,C151)-1)","v":""},"","",""]
[{"$f":"IF('Incident Log'!C152=\"\",\"\",'Incident Log'!C152)","v":""},{"$f":"IFERROR(INDEX($A$11:$A$500, MATCH(0, COUNTIF($B$10:B151, $A$11:$A$500), 0)),\"\")","v":""},{"$f":"IF(B152=\"\",\"\",COUNTIF('Incident Log'!$C$11:$C$500,B152))","v":""},{"$f":"IF(B152=\"\",\"\",RANK(C152,$C$11:$C$500)+COUNTIF($C$11:C152,C152)-1)","v":""},"","",""]
[{"$f":"IF('Incident Log'!C153=\"\",\"\",'Incident Log'!C153)","v":""},{"$f":"IFERROR(INDEX($A$11:$A$500, MATCH(0, COUNTIF($B$10:B152, $A$11:$A$500), 0)),\"\")","v":""},{"$f":"IF(B153=\"\",\"\",COUNTIF('Incident Log'!$C$11:$C$500,B153))","v":""},{"$f":"IF(B153=\"\",\"\",RANK(C153,$C$11:$C$500)+COUNTIF($C$11:C153,C153)-1)","v":""},"","",""]
[{"$f":"IF('Incident Log'!C154=\"\",\"\",'Incident Log'!C154)","v":""},{"$f":"IFERROR(INDEX($A$11:$A$500, MATCH(0, COUNTIF($B$10:B153, $A$11:$A$500), 0)),\"\")","v":""},{"$f":"IF(B154=\"\",\"\",COUNTIF('Incident Log'!$C$11:$C$500,B154))","v":""},{"$f":"IF(B154=\"\",\"\",RANK(C154,$C$11:$C$500)+COUNTIF($C$11:C154,C154)-1)","v":""},"","",""]
[{"$f":"IF('Incident Log'!C155=\"\",\"\",'Incident Log'!C155)","v":""},{"$f":"IFERROR(INDEX($A$11:$A$500, MATCH(0, COUNTIF($B$10:B154, $A$11:$A$500), 0)),\"\")","v":""},{"$f":"IF(B155=\"\",\"\",COUNTIF('Incident Log'!$C$11:$C$500,B155))","v":""},{"$f":"IF(B155=\"\",\"\",RANK(C155,$C$11:$C$500)+COUNTIF($C$11:C155,C155)-1)","v":""},"","",""]
[{"$f":"IF('Incident Log'!C156=\"\",\"\",'Incident Log'!C156)","v":""},{"$f":"IFERROR(INDEX($A$11:$A$500, MATCH(0, COUNTIF($B$10:B155, $A$11:$A$500), 0)),\"\")","v":""},{"$f":"IF(B156=\"\",\"\",COUNTIF('Incident Log'!$C$11:$C$500,B156))","v":""},{"$f":"IF(B156=\"\",\"\",RANK(C156,$C$11:$C$500)+COUNTIF($C$11:C156,C156)-1)","v":""},"","",""]
[{"$f":"IF('Incident Log'!C157=\"\",\"\",'Incident Log'!C157)","v":""},{"$f":"IFERROR(INDEX($A$11:$A$500, MATCH(0, COUNTIF($B$10:B156, $A$11:$A$500), 0)),\"\")","v":""},{"$f":"IF(B157=\"\",\"\",COUNTIF('Incident Log'!$C$11:$C$500,B157))","v":""},{"$f":"IF(B157=\"\",\"\",RANK(C157,$C$11:$C$500)+COUNTIF($C$11:C157,C157)-1)","v":""},"","",""]
[{"$f":"IF('Incident Log'!C158=\"\",\"\",'Incident Log'!C158)","v":""},{"$f":"IFERROR(INDEX($A$11:$A$500, MATCH(0, COUNTIF($B$10:B157, $A$11:$A$500), 0)),\"\")","v":""},{"$f":"IF(B158=\"\",\"\",COUNTIF('Incident Log'!$C$11:$C$500,B158))","v":""},{"$f":"IF(B158=\"\",\"\",RANK(C158,$C$11:$C$500)+COUNTIF($C$11:C158,C158)-1)","v":""},"","",""]
[{"$f":"IF('Incident Log'!C159=\"\",\"\",'Incident Log'!C159)","v":""},{"$f":"IFERROR(INDEX($A$11:$A$500, MATCH(0, COUNTIF($B$10:B158, $A$11:$A$500), 0)),\"\")","v":""},{"$f":"IF(B159=\"\",\"\",COUNTIF('Incident Log'!$C$11:$C$500,B159))","v":""},{"$f":"IF(B159=\"\",\"\",RANK(C159,$C$11:$C$500)+COUNTIF($C$11:C159,C159)-1)","v":""},"","",""]
[{"$f":"IF('Incident Log'!C160=\"\",\"\",'Incident Log'!C160)","v":""},{"$f":"IFERROR(INDEX($A$11:$A$500, MATCH(0, COUNTIF($B$10:B159, $A$11:$A$500), 0)),\"\")","v":""},{"$f":"IF(B160=\"\",\"\",COUNTIF('Incident Log'!$C$11:$C$500,B160))","v":""},{"$f":"IF(B160=\"\",\"\",RANK(C160,$C$11:$C$500)+COUNTIF($C$11:C160,C160)-1)","v":""},"","",""]
[{"$f":"IF('Incident Log'!C161=\"\",\"\",'Incident Log'!C161)","v":""},{"$f":"IFERROR(INDEX($A$11:$A$500, MATCH(0, COUNTIF($B$10:B160, $A$11:$A$500), 0)),\"\")","v":""},{"$f":"IF(B161=\"\",\"\",COUNTIF('Incident Log'!$C$11:$C$500,B161))","v":""},{"$f":"IF(B161=\"\",\"\",RANK(C161,$C$11:$C$500)+COUNTIF($C$11:C161,C161)-1)","v":""},"","",""]
[{"$f":"IF('Incident Log'!C162=\"\",\"\",'Incident Log'!C162)","v":""},{"$f":"IFERROR(INDEX($A$11:$A$500, MATCH(0, COUNTIF($B$10:B161, $A$11:$A$500), 0)),\"\")","v":""},{"$f":"IF(B162=\"\",\"\",COUNTIF('Incident Log'!$C$11:$C$500,B162))","v":""},{"$f":"IF(B162=\"\",\"\",RANK(C162,$C$11:$C$500)+COUNTIF($C$11:C162,C162)-1)","v":""},"","",""]
[{"$f":"IF('Incident Log'!C163=\"\",\"\",'Incident Log'!C163)","v":""},{"$f":"IFERROR(INDEX($A$11:$A$500, MATCH(0, COUNTIF($B$10:B162, $A$11:$A$500), 0)),\"\")","v":""},{"$f":"IF(B163=\"\",\"\",COUNTIF('Incident Log'!$C$11:$C$500,B163))","v":""},{"$f":"IF(B163=\"\",\"\",RANK(C163,$C$11:$C$500)+COUNTIF($C$11:C163,C163)-1)","v":""},"","",""]
[{"$f":"IF('Incident Log'!C164=\"\",\"\",'Incident Log'!C164)","v":""},{"$f":"IFERROR(INDEX($A$11:$A$500, MATCH(0, COUNTIF($B$10:B163, $A$11:$A$500), 0)),\"\")","v":""},{"$f":"IF(B164=\"\",\"\",COUNTIF('Incident Log'!$C$11:$C$500,B164))","v":""},{"$f":"IF(B164=\"\",\"\",RANK(C164,$C$11:$C$500)+COUNTIF($C$11:C164,C164)-1)","v":""},"","",""]
[{"$f":"IF('Incident Log'!C165=\"\",\"\",'Incident Log'!C165)","v":""},{"$f":"IFERROR(INDEX($A$11:$A$500, MATCH(0, COUNTIF($B$10:B164, $A$11:$A$500), 0)),\"\")","v":""},{"$f":"IF(B165=\"\",\"\",COUNTIF('Incident Log'!$C$11:$C$500,B165))","v":""},{"$f":"IF(B165=\"\",\"\",RANK(C165,$C$11:$C$500)+COUNTIF($C$11:C165,C165)-1)","v":""},"","",""]
[{"$f":"IF('Incident Log'!C166=\"\",\"\",'Incident Log'!C166)","v":""},{"$f":"IFERROR(INDEX($A$11:$A$500, MATCH(0, COUNTIF($B$10:B165, $A$11:$A$500), 0)),\"\")","v":""},{"$f":"IF(B166=\"\",\"\",COUNTIF('Incident Log'!$C$11:$C$500,B166))","v":""},{"$f":"IF(B166=\"\",\"\",RANK(C166,$C$11:$C$500)+COUNTIF($C$11:C166,C166)-1)","v":""},"","",""]
[{"$f":"IF('Incident Log'!C167=\"\",\"\",'Incident Log'!C167)","v":""},{"$f":"IFERROR(INDEX($A$11:$A$500, MATCH(0, COUNTIF($B$10:B166, $A$11:$A$500), 0)),\"\")","v":""},{"$f":"IF(B167=\"\",\"\",COUNTIF('Incident Log'!$C$11:$C$500,B167))","v":""},{"$f":"IF(B167=\"\",\"\",RANK(C167,$C$11:$C$500)+COUNTIF($C$11:C167,C167)-1)","v":""},"","",""]
[{"$f":"IF('Incident Log'!C168=\"\",\"\",'Incident Log'!C168)","v":""},{"$f":"IFERROR(INDEX($A$11:$A$500, MATCH(0, COUNTIF($B$10:B167, $A$11:$A$500), 0)),\"\")","v":""},{"$f":"IF(B168=\"\",\"\",COUNTIF('Incident Log'!$C$11:$C$500,B168))","v":""},{"$f":"IF(B168=\"\",\"\",RANK(C168,$C$11:$C$500)+COUNTIF($C$11:C168,C168)-1)","v":""},"","",""]
[{"$f":"IF('Incident Log'!C169=\"\",\"\",'Incident Log'!C169)","v":""},{"$f":"IFERROR(INDEX($A$11:$A$500, MATCH(0, COUNTIF($B$10:B168, $A$11:$A$500), 0)),\"\")","v":""},{"$f":"IF(B169=\"\",\"\",COUNTIF('Incident Log'!$C$11:$C$500,B169))","v":""},{"$f":"IF(B169=\"\",\"\",RANK(C169,$C$11:$C$500)+COUNTIF($C$11:C169,C169)-1)","v":""},"","",""]
[{"$f":"IF('Incident Log'!C170=\"\",\"\",'Incident Log'!C170)","v":""},{"$f":"IFERROR(INDEX($A$11:$A$500, MATCH(0, COUNTIF($B$10:B169, $A$11:$A$500), 0)),\"\")","v":""},{"$f":"IF(B170=\"\",\"\",COUNTIF('Incident Log'!$C$11:$C$500,B170))","v":""},{"$f":"IF(B170=\"\",\"\",RANK(C170,$C$11:$C$500)+COUNTIF($C$11:C170,C170)-1)","v":""},"","",""]
[{"$f":"IF('Incident Log'!C171=\"\",\"\",'Incident Log'!C171)","v":""},{"$f":"IFERROR(INDEX($A$11:$A$500, MATCH(0, COUNTIF($B$10:B170, $A$11:$A$500), 0)),\"\")","v":""},{"$f":"IF(B171=\"\",\"\",COUNTIF('Incident Log'!$C$11:$C$500,B171))","v":""},{"$f":"IF(B171=\"\",\"\",RANK(C171,$C$11:$C$500)+COUNTIF($C$11:C171,C171)-1)","v":""},"","",""]
[{"$f":"IF('Incident Log'!C172=\"\",\"\",'Incident Log'!C172)","v":""},{"$f":"IFERROR(INDEX($A$11:$A$500, MATCH(0, COUNTIF($B$10:B171, $A$11:$A$500), 0)),\"\")","v":""},{"$f":"IF(B172=\"\",\"\",COUNTIF('Incident Log'!$C$11:$C$500,B172))","v":""},{"$f":"IF(B172=\"\",\"\",RANK(C172,$C$11:$C$500)+COUNTIF($C$11:C172,C172)-1)","v":""},"","",""]
[{"$f":"IF('Incident Log'!C173=\"\",\"\",'Incident Log'!C173)","v":""},{"$f":"IFERROR(INDEX($A$11:$A$500, MATCH(0, COUNTIF($B$10:B172, $A$11:$A$500), 0)),\"\")","v":""},{"$f":"IF(B173=\"\",\"\",COUNTIF('Incident Log'!$C$11:$C$500,B173))","v":""},{"$f":"IF(B173=\"\",\"\",RANK(C173,$C$11:$C$500)+COUNTIF($C$11:C173,C173)-1)","v":""},"","",""]
[{"$f":"IF('Incident Log'!C174=\"\",\"\",'Incident Log'!C174)","v":""},{"$f":"IFERROR(INDEX($A$11:$A$500, MATCH(0, COUNTIF($B$10:B173, $A$11:$A$500), 0)),\"\")","v":""},{"$f":"IF(B174=\"\",\"\",COUNTIF('Incident Log'!$C$11:$C$500,B174))","v":""},{"$f":"IF(B174=\"\",\"\",RANK(C174,$C$11:$C$500)+COUNTIF($C$11:C174,C174)-1)","v":""},"","",""]
[{"$f":"IF('Incident Log'!C175=\"\",\"\",'Incident Log'!C175)","v":""},{"$f":"IFERROR(INDEX($A$11:$A$500, MATCH(0, COUNTIF($B$10:B174, $A$11:$A$500), 0)),\"\")","v":""},{"$f":"IF(B175=\"\",\"\",COUNTIF('Incident Log'!$C$11:$C$500,B175))","v":""},{"$f":"IF(B175=\"\",\"\",RANK(C175,$C$11:$C$500)+COUNTIF($C$11:C175,C175)-1)","v":""},"","",""]
[{"$f":"IF('Incident Log'!C176=\"\",\"\",'Incident Log'!C176)","v":""},{"$f":"IFERROR(INDEX($A$11:$A$500, MATCH(0, COUNTIF($B$10:B175, $A$11:$A$500), 0)),\"\")","v":""},{"$f":"IF(B176=\"\",\"\",COUNTIF('Incident Log'!$C$11:$C$500,B176))","v":""},{"$f":"IF(B176=\"\",\"\",RANK(C176,$C$11:$C$500)+COUNTIF($C$11:C176,C176)-1)","v":""},"","",""]
[{"$f":"IF('Incident Log'!C177=\"\",\"\",'Incident Log'!C177)","v":""},{"$f":"IFERROR(INDEX($A$11:$A$500, MATCH(0, COUNTIF($B$10:B176, $A$11:$A$500), 0)),\"\")","v":""},{"$f":"IF(B177=\"\",\"\",COUNTIF('Incident Log'!$C$11:$C$500,B177))","v":""},{"$f":"IF(B177=\"\",\"\",RANK(C177,$C$11:$C$500)+COUNTIF($C$11:C177,C177)-1)","v":""},"","",""]
[{"$f":"IF('Incident Log'!C178=\"\",\"\",'Incident Log'!C178)","v":""},{"$f":"IFERROR(INDEX($A$11:$A$500, MATCH(0, COUNTIF($B$10:B177, $A$11:$A$500), 0)),\"\")","v":""},{"$f":"IF(B178=\"\",\"\",COUNTIF('Incident Log'!$C$11:$C$500,B178))","v":""},{"$f":"IF(B178=\"\",\"\",RANK(C178,$C$11:$C$500)+COUNTIF($C$11:C178,C178)-1)","v":""},"","",""]
[{"$f":"IF('Incident Log'!C179=\"\",\"\",'Incident Log'!C179)","v":""},{"$f":"IFERROR(INDEX($A$11:$A$500, MATCH(0, COUNTIF($B$10:B178, $A$11:$A$500), 0)),\"\")","v":""},{"$f":"IF(B179=\"\",\"\",COUNTIF('Incident Log'!$C$11:$C$500,B179))","v":""},{"$f":"IF(B179=\"\",\"\",RANK(C179,$C$11:$C$500)+COUNTIF($C$11:C179,C179)-1)","v":""},"","",""]
[{"$f":"IF('Incident Log'!C180=\"\",\"\",'Incident Log'!C180)","v":""},{"$f":"IFERROR(INDEX($A$11:$A$500, MATCH(0, COUNTIF($B$10:B179, $A$11:$A$500), 0)),\"\")","v":""},{"$f":"IF(B180=\"\",\"\",COUNTIF('Incident Log'!$C$11:$C$500,B180))","v":""},{"$f":"IF(B180=\"\",\"\",RANK(C180,$C$11:$C$500)+COUNTIF($C$11:C180,C180)-1)","v":""},"","",""]
[{"$f":"IF('Incident Log'!C181=\"\",\"\",'Incident Log'!C181)","v":""},{"$f":"IFERROR(INDEX($A$11:$A$500, MATCH(0, COUNTIF($B$10:B180, $A$11:$A$500), 0)),\"\")","v":""},{"$f":"IF(B181=\"\",\"\",COUNTIF('Incident Log'!$C$11:$C$500,B181))","v":""},{"$f":"IF(B181=\"\",\"\",RANK(C181,$C$11:$C$500)+COUNTIF($C$11:C181,C181)-1)","v":""},"","",""]
[{"$f":"IF('Incident Log'!C182=\"\",\"\",'Incident Log'!C182)","v":""},{"$f":"IFERROR(INDEX($A$11:$A$500, MATCH(0, COUNTIF($B$10:B181, $A$11:$A$500), 0)),\"\")","v":""},{"$f":"IF(B182=\"\",\"\",COUNTIF('Incident Log'!$C$11:$C$500,B182))","v":""},{"$f":"IF(B182=\"\",\"\",RANK(C182,$C$11:$C$500)+COUNTIF($C$11:C182,C182)-1)","v":""},"","",""]
[{"$f":"IF('Incident Log'!C183=\"\",\"\",'Incident Log'!C183)","v":""},{"$f":"IFERROR(INDEX($A$11:$A$500, MATCH(0, COUNTIF($B$10:B182, $A$11:$A$500), 0)),\"\")","v":""},{"$f":"IF(B183=\"\",\"\",COUNTIF('Incident Log'!$C$11:$C$500,B183))","v":""},{"$f":"IF(B183=\"\",\"\",RANK(C183,$C$11:$C$500)+COUNTIF($C$11:C183,C183)-1)","v":""},"","",""]
[{"$f":"IF('Incident Log'!C184=\"\",\"\",'Incident Log'!C184)","v":""},{"$f":"IFERROR(INDEX($A$11:$A$500, MATCH(0, COUNTIF($B$10:B183, $A$11:$A$500), 0)),\"\")","v":""},{"$f":"IF(B184=\"\",\"\",COUNTIF('Incident Log'!$C$11:$C$500,B184))","v":""},{"$f":"IF(B184=\"\",\"\",RANK(C184,$C$11:$C$500)+COUNTIF($C$11:C184,C184)-1)","v":""},"","",""]
[{"$f":"IF('Incident Log'!C185=\"\",\"\",'Incident Log'!C185)","v":""},{"$f":"IFERROR(INDEX($A$11:$A$500, MATCH(0, COUNTIF($B$10:B184, $A$11:$A$500), 0)),\"\")","v":""},{"$f":"IF(B185=\"\",\"\",COUNTIF('Incident Log'!$C$11:$C$500,B185))","v":""},{"$f":"IF(B185=\"\",\"\",RANK(C185,$C$11:$C$500)+COUNTIF($C$11:C185,C185)-1)","v":""},"","",""]
[{"$f":"IF('Incident Log'!C186=\"\",\"\",'Incident Log'!C186)","v":""},{"$f":"IFERROR(INDEX($A$11:$A$500, MATCH(0, COUNTIF($B$10:B185, $A$11:$A$500), 0)),\"\")","v":""},{"$f":"IF(B186=\"\",\"\",COUNTIF('Incident Log'!$C$11:$C$500,B186))","v":""},{"$f":"IF(B186=\"\",\"\",RANK(C186,$C$11:$C$500)+COUNTIF($C$11:C186,C186)-1)","v":""},"","",""]
[{"$f":"IF('Incident Log'!C187=\"\",\"\",'Incident Log'!C187)","v":""},{"$f":"IFERROR(INDEX($A$11:$A$500, MATCH(0, COUNTIF($B$10:B186, $A$11:$A$500), 0)),\"\")","v":""},{"$f":"IF(B187=\"\",\"\",COUNTIF('Incident Log'!$C$11:$C$500,B187))","v":""},{"$f":"IF(B187=\"\",\"\",RANK(C187,$C$11:$C$500)+COUNTIF($C$11:C187,C187)-1)","v":""},"","",""]
[{"$f":"IF('Incident Log'!C188=\"\",\"\",'Incident Log'!C188)","v":""},{"$f":"IFERROR(INDEX($A$11:$A$500, MATCH(0, COUNTIF($B$10:B187, $A$11:$A$500), 0)),\"\")","v":""},{"$f":"IF(B188=\"\",\"\",COUNTIF('Incident Log'!$C$11:$C$500,B188))","v":""},{"$f":"IF(B188=\"\",\"\",RANK(C188,$C$11:$C$500)+COUNTIF($C$11:C188,C188)-1)","v":""},"","",""]
[{"$f":"IF('Incident Log'!C189=\"\",\"\",'Incident Log'!C189)","v":""},{"$f":"IFERROR(INDEX($A$11:$A$500, MATCH(0, COUNTIF($B$10:B188, $A$11:$A$500), 0)),\"\")","v":""},{"$f":"IF(B189=\"\",\"\",COUNTIF('Incident Log'!$C$11:$C$500,B189))","v":""},{"$f":"IF(B189=\"\",\"\",RANK(C189,$C$11:$C$500)+COUNTIF($C$11:C189,C189)-1)","v":""},"","",""]
[{"$f":"IF('Incident Log'!C190=\"\",\"\",'Incident Log'!C190)","v":""},{"$f":"IFERROR(INDEX($A$11:$A$500, MATCH(0, COUNTIF($B$10:B189, $A$11:$A$500), 0)),\"\")","v":""},{"$f":"IF(B190=\"\",\"\",COUNTIF('Incident Log'!$C$11:$C$500,B190))","v":""},{"$f":"IF(B190=\"\",\"\",RANK(C190,$C$11:$C$500)+COUNTIF($C$11:C190,C190)-1)","v":""},"","",""]
[{"$f":"IF('Incident Log'!C191=\"\",\"\",'Incident Log'!C191)","v":""},{"$f":"IFERROR(INDEX($A$11:$A$500, MATCH(0, COUNTIF($B$10:B190, $A$11:$A$500), 0)),\"\")","v":""},{"$f":"IF(B191=\"\",\"\",COUNTIF('Incident Log'!$C$11:$C$500,B191))","v":""},{"$f":"IF(B191=\"\",\"\",RANK(C191,$C$11:$C$500)+COUNTIF($C$11:C191,C191)-1)","v":""},"","",""]
[{"$f":"IF('Incident Log'!C192=\"\",\"\",'Incident Log'!C192)","v":""},{"$f":"IFERROR(INDEX($A$11:$A$500, MATCH(0, COUNTIF($B$10:B191, $A$11:$A$500), 0)),\"\")","v":""},{"$f":"IF(B192=\"\",\"\",COUNTIF('Incident Log'!$C$11:$C$500,B192))","v":""},{"$f":"IF(B192=\"\",\"\",RANK(C192,$C$11:$C$500)+COUNTIF($C$11:C192,C192)-1)","v":""},"","",""]
[{"$f":"IF('Incident Log'!C193=\"\",\"\",'Incident Log'!C193)","v":""},{"$f":"IFERROR(INDEX($A$11:$A$500, MATCH(0, COUNTIF($B$10:B192, $A$11:$A$500), 0)),\"\")","v":""},{"$f":"IF(B193=\"\",\"\",COUNTIF('Incident Log'!$C$11:$C$500,B193))","v":""},{"$f":"IF(B193=\"\",\"\",RANK(C193,$C$11:$C$500)+COUNTIF($C$11:C193,C193)-1)","v":""},"","",""]
[{"$f":"IF('Incident Log'!C194=\"\",\"\",'Incident Log'!C194)","v":""},{"$f":"IFERROR(INDEX($A$11:$A$500, MATCH(0, COUNTIF($B$10:B193, $A$11:$A$500), 0)),\"\")","v":""},{"$f":"IF(B194=\"\",\"\",COUNTIF('Incident Log'!$C$11:$C$500,B194))","v":""},{"$f":"IF(B194=\"\",\"\",RANK(C194,$C$11:$C$500)+COUNTIF($C$11:C194,C194)-1)","v":""},"","",""]
[{"$f":"IF('Incident Log'!C195=\"\",\"\",'Incident Log'!C195)","v":""},{"$f":"IFERROR(INDEX($A$11:$A$500, MATCH(0, COUNTIF($B$10:B194, $A$11:$A$500), 0)),\"\")","v":""},{"$f":"IF(B195=\"\",\"\",COUNTIF('Incident Log'!$C$11:$C$500,B195))","v":""},{"$f":"IF(B195=\"\",\"\",RANK(C195,$C$11:$C$500)+COUNTIF($C$11:C195,C195)-1)","v":""},"","",""]
[{"$f":"IF('Incident Log'!C196=\"\",\"\",'Incident Log'!C196)","v":""},{"$f":"IFERROR(INDEX($A$11:$A$500, MATCH(0, COUNTIF($B$10:B195, $A$11:$A$500), 0)),\"\")","v":""},{"$f":"IF(B196=\"\",\"\",COUNTIF('Incident Log'!$C$11:$C$500,B196))","v":""},{"$f":"IF(B196=\"\",\"\",RANK(C196,$C$11:$C$500)+COUNTIF($C$11:C196,C196)-1)","v":""},"","",""]
[{"$f":"IF('Incident Log'!C197=\"\",\"\",'Incident Log'!C197)","v":""},{"$f":"IFERROR(INDEX($A$11:$A$500, MATCH(0, COUNTIF($B$10:B196, $A$11:$A$500), 0)),\"\")","v":""},{"$f":"IF(B197=\"\",\"\",COUNTIF('Incident Log'!$C$11:$C$500,B197))","v":""},{"$f":"IF(B197=\"\",\"\",RANK(C197,$C$11:$C$500)+COUNTIF($C$11:C197,C197)-1)","v":""},"","",""]
[{"$f":"IF('Incident Log'!C198=\"\",\"\",'Incident Log'!C198)","v":""},{"$f":"IFERROR(INDEX($A$11:$A$500, MATCH(0, COUNTIF($B$10:B197, $A$11:$A$500), 0)),\"\")","v":""},{"$f":"IF(B198=\"\",\"\",COUNTIF('Incident Log'!$C$11:$C$500,B198))","v":""},{"$f":"IF(B198=\"\",\"\",RANK(C198,$C$11:$C$500)+COUNTIF($C$11:C198,C198)-1)","v":""},"","",""]
[{"$f":"IF('Incident Log'!C199=\"\",\"\",'Incident Log'!C199)","v":""},{"$f":"IFERROR(INDEX($A$11:$A$500, MATCH(0, COUNTIF($B$10:B198, $A$11:$A$500), 0)),\"\")","v":""},{"$f":"IF(B199=\"\",\"\",COUNTIF('Incident Log'!$C$11:$C$500,B199))","v":""},{"$f":"IF(B199=\"\",\"\",RANK(C199,$C$11:$C$500)+COUNTIF($C$11:C199,C199)-1)","v":""},"","",""]
[{"$f":"IF('Incident Log'!C200=\"\",\"\",'Incident Log'!C200)","v":""},{"$f":"IFERROR(INDEX($A$11:$A$500, MATCH(0, COUNTIF($B$10:B199, $A$11:$A$500), 0)),\"\")","v":""},{"$f":"IF(B200=\"\",\"\",COUNTIF('Incident Log'!$C$11:$C$500,B200))","v":""},{"$f":"IF(B200=\"\",\"\",RANK(C200,$C$11:$C$500)+COUNTIF($C$11:C200,C200)-1)","v":""},"","",""]
[{"$f":"IF('Incident Log'!C201=\"\",\"\",'Incident Log'!C201)","v":""},{"$f":"IFERROR(INDEX($A$11:$A$500, MATCH(0, COUNTIF($B$10:B200, $A$11:$A$500), 0)),\"\")","v":""},{"$f":"IF(B201=\"\",\"\",COUNTIF('Incident Log'!$C$11:$C$500,B201))","v":""},{"$f":"IF(B201=\"\",\"\",RANK(C201,$C$11:$C$500)+COUNTIF($C$11:C201,C201)-1)","v":""},"","",""]
[{"$f":"IF('Incident Log'!C202=\"\",\"\",'Incident Log'!C202)","v":""},{"$f":"IFERROR(INDEX($A$11:$A$500, MATCH(0, COUNTIF($B$10:B201, $A$11:$A$500), 0)),\"\")","v":""},{"$f":"IF(B202=\"\",\"\",COUNTIF('Incident Log'!$C$11:$C$500,B202))","v":""},{"$f":"IF(B202=\"\",\"\",RANK(C202,$C$11:$C$500)+COUNTIF($C$11:C202,C202)-1)","v":""},"","",""]
[{"$f":"IF('Incident Log'!C203=\"\",\"\",'Incident Log'!C203)","v":""},{"$f":"IFERROR(INDEX($A$11:$A$500, MATCH(0, COUNTIF($B$10:B202, $A$11:$A$500), 0)),\"\")","v":""},{"$f":"IF(B203=\"\",\"\",COUNTIF('Incident Log'!$C$11:$C$500,B203))","v":""},{"$f":"IF(B203=\"\",\"\",RANK(C203,$C$11:$C$500)+COUNTIF($C$11:C203,C203)-1)","v":""},"","",""]
[{"$f":"IF('Incident Log'!C204=\"\",\"\",'Incident Log'!C204)","v":""},{"$f":"IFERROR(INDEX($A$11:$A$500, MATCH(0, COUNTIF($B$10:B203, $A$11:$A$500), 0)),\"\")","v":""},{"$f":"IF(B204=\"\",\"\",COUNTIF('Incident Log'!$C$11:$C$500,B204))","v":""},{"$f":"IF(B204=\"\",\"\",RANK(C204,$C$11:$C$500)+COUNTIF($C$11:C204,C204)-1)","v":""},"",{"$f":"IF(B204=\"\",\"\",INDEX($B$11:$B$500,MATCH(E204,$D$11:$D$500,0)))","v":""},{"$f":"IF(B204=\"\",\"\",VLOOKUP(F204,$B$11:$C$500,2,FALSE))","v":""}]
[{"$f":"IF('Incident Log'!C205=\"\",\"\",'Incident Log'!C205)","v":""},{"$f":"IFERROR(INDEX($A$11:$A$500, MATCH(0, COUNTIF($B$10:B204, $A$11:$A$500), 0)),\"\")","v":""},{"$f":"IF(B205=\"\",\"\",COUNTIF('Incident Log'!$C$11:$C$500,B205))","v":""},{"$f":"IF(B205=\"\",\"\",RANK(C205,$C$11:$C$500)+COUNTIF($C$11:C205,C205)-1)","v":""},"","",""]
[{"$f":"IF('Incident Log'!C206=\"\",\"\",'Incident Log'!C206)","v":""},{"$f":"IFERROR(INDEX($A$11:$A$500, MATCH(0, COUNTIF($B$10:B205, $A$11:$A$500), 0)),\"\")","v":""},{"$f":"IF(B206=\"\",\"\",COUNTIF('Incident Log'!$C$11:$C$500,B206))","v":""},{"$f":"IF(B206=\"\",\"\",RANK(C206,$C$11:$C$500)+COUNTIF($C$11:C206,C206)-1)","v":""},{"$f":"IF(B206=\"\",\"\",1+E205)","v":""},"",""]
[{"$f":"IF('Incident Log'!C207=\"\",\"\",'Incident Log'!C207)","v":""},{"$f":"IFERROR(INDEX($A$11:$A$500, MATCH(0, COUNTIF($B$10:B206, $A$11:$A$500), 0)),\"\")","v":""},{"$f":"IF(B207=\"\",\"\",COUNTIF('Incident Log'!$C$11:$C$500,B207))","v":""},{"$f":"IF(B207=\"\",\"\",RANK(C207,$C$11:$C$500)+COUNTIF($C$11:C207,C207)-1)","v":""},"","",""]
[{"$f":"IF('Incident Log'!C208=\"\",\"\",'Incident Log'!C208)","v":""},{"$f":"IFERROR(INDEX($A$11:$A$500, MATCH(0, COUNTIF($B$10:B207, $A$11:$A$500), 0)),\"\")","v":""},{"$f":"IF(B208=\"\",\"\",COUNTIF('Incident Log'!$C$11:$C$500,B208))","v":""},{"$f":"IF(B208=\"\",\"\",RANK(C208,$C$11:$C$500)+COUNTIF($C$11:C208,C208)-1)","v":""},"","",""]
[{"$f":"IF('Incident Log'!C209=\"\",\"\",'Incident Log'!C209)","v":""},{"$f":"IFERROR(INDEX($A$11:$A$500, MATCH(0, COUNTIF($B$10:B208, $A$11:$A$500), 0)),\"\")","v":""},{"$f":"IF(B209=\"\",\"\",COUNTIF('Incident Log'!$C$11:$C$500,B209))","v":""},{"$f":"IF(B209=\"\",\"\",RANK(C209,$C$11:$C$500)+COUNTIF($C$11:C209,C209)-1)","v":""},"","",""]
[{"$f":"IF('Incident Log'!C210=\"\",\"\",'Incident Log'!C210)","v":""},{"$f":"IFERROR(INDEX($A$11:$A$500, MATCH(0, COUNTIF($B$10:B209, $A$11:$A$500), 0)),\"\")","v":""},{"$f":"IF(B210=\"\",\"\",COUNTIF('Incident Log'!$C$11:$C$500,B210))","v":""},{"$f":"IF(B210=\"\",\"\",RANK(C210,$C$11:$C$500)+COUNTIF($C$11:C210,C210)-1)","v":""},"","",""]
[{"$f":"IF('Incident Log'!C211=\"\",\"\",'Incident Log'!C211)","v":""},{"$f":"IFERROR(INDEX($A$11:$A$500, MATCH(0, COUNTIF($B$10:B210, $A$11:$A$500), 0)),\"\")","v":""},{"$f":"IF(B211=\"\",\"\",COUNTIF('Incident Log'!$C$11:$C$500,B211))","v":""},{"$f":"IF(B211=\"\",\"\",RANK(C211,$C$11:$C$500)+COUNTIF($C$11:C211,C211)-1)","v":""},"","",""]
[{"$f":"IF('Incident Log'!C212=\"\",\"\",'Incident Log'!C212)","v":""},{"$f":"IFERROR(INDEX($A$11:$A$500, MATCH(0, COUNTIF($B$10:B211, $A$11:$A$500), 0)),\"\")","v":""},{"$f":"IF(B212=\"\",\"\",COUNTIF('Incident Log'!$C$11:$C$500,B212))","v":""},{"$f":"IF(B212=\"\",\"\",RANK(C212,$C$11:$C$500)+COUNTIF($C$11:C212,C212)-1)","v":""},"","",""]
[{"$f":"IF('Incident Log'!C213=\"\",\"\",'Incident Log'!C213)","v":""},{"$f":"IFERROR(INDEX($A$11:$A$500, MATCH(0, COUNTIF($B$10:B212, $A$11:$A$500), 0)),\"\")","v":""},{"$f":"IF(B213=\"\",\"\",COUNTIF('Incident Log'!$C$11:$C$500,B213))","v":""},{"$f":"IF(B213=\"\",\"\",RANK(C213,$C$11:$C$500)+COUNTIF($C$11:C213,C213)-1)","v":""},"","",""]
[{"$f":"IF('Incident Log'!C214=\"\",\"\",'Incident Log'!C214)","v":""},{"$f":"IFERROR(INDEX($A$11:$A$500, MATCH(0, COUNTIF($B$10:B213, $A$11:$A$500), 0)),\"\")","v":""},{"$f":"IF(B214=\"\",\"\",COUNTIF('Incident Log'!$C$11:$C$500,B214))","v":""},{"$f":"IF(B214=\"\",\"\",RANK(C214,$C$11:$C$500)+COUNTIF($C$11:C214,C214)-1)","v":""},"","",""]
[{"$f":"IF('Incident Log'!C215=\"\",\"\",'Incident Log'!C215)","v":""},{"$f":"IFERROR(INDEX($A$11:$A$500, MATCH(0, COUNTIF($B$10:B214, $A$11:$A$500), 0)),\"\")","v":""},{"$f":"IF(B215=\"\",\"\",COUNTIF('Incident Log'!$C$11:$C$500,B215))","v":""},{"$f":"IF(B215=\"\",\"\",RANK(C215,$C$11:$C$500)+COUNTIF($C$11:C215,C215)-1)","v":""},"","",""]
[{"$f":"IF('Incident Log'!C216=\"\",\"\",'Incident Log'!C216)","v":""},{"$f":"IFERROR(INDEX($A$11:$A$500, MATCH(0, COUNTIF($B$10:B215, $A$11:$A$500), 0)),\"\")","v":""},{"$f":"IF(B216=\"\",\"\",COUNTIF('Incident Log'!$C$11:$C$500,B216))","v":""},{"$f":"IF(B216=\"\",\"\",RANK(C216,$C$11:$C$500)+COUNTIF($C$11:C216,C216)-1)","v":""},"","",""]
[{"$f":"IF('Incident Log'!C217=\"\",\"\",'Incident Log'!C217)","v":""},{"$f":"IFERROR(INDEX($A$11:$A$500, MATCH(0, COUNTIF($B$10:B216, $A$11:$A$500), 0)),\"\")","v":""},{"$f":"IF(B217=\"\",\"\",COUNTIF('Incident Log'!$C$11:$C$500,B217))","v":""},{"$f":"IF(B217=\"\",\"\",RANK(C217,$C$11:$C$500)+COUNTIF($C$11:C217,C217)-1)","v":""},"","",""]
[{"$f":"IF('Incident Log'!C218=\"\",\"\",'Incident Log'!C218)","v":""},{"$f":"IFERROR(INDEX($A$11:$A$500, MATCH(0, COUNTIF($B$10:B217, $A$11:$A$500), 0)),\"\")","v":""},{"$f":"IF(B218=\"\",\"\",COUNTIF('Incident Log'!$C$11:$C$500,B218))","v":""},{"$f":"IF(B218=\"\",\"\",RANK(C218,$C$11:$C$500)+COUNTIF($C$11:C218,C218)-1)","v":""},"","",""]
[{"$f":"IF('Incident Log'!C219=\"\",\"\",'Incident Log'!C219)","v":""},{"$f":"IFERROR(INDEX($A$11:$A$500, MATCH(0, COUNTIF($B$10:B218, $A$11:$A$500), 0)),\"\")","v":""},{"$f":"IF(B219=\"\",\"\",COUNTIF('Incident Log'!$C$11:$C$500,B219))","v":""},{"$f":"IF(B219=\"\",\"\",RANK(C219,$C$11:$C$500)+COUNTIF($C$11:C219,C219)-1)","v":""},"","",""]
[{"$f":"IF('Incident Log'!C220=\"\",\"\",'Incident Log'!C220)","v":""},{"$f":"IFERROR(INDEX($A$11:$A$500, MATCH(0, COUNTIF($B$10:B219, $A$11:$A$500), 0)),\"\")","v":""},{"$f":"IF(B220=\"\",\"\",COUNTIF('Incident Log'!$C$11:$C$500,B220))","v":""},{"$f":"IF(B220=\"\",\"\",RANK(C220,$C$11:$C$500)+COUNTIF($C$11:C220,C220)-1)","v":""},"","",""]
[{"$f":"IF('Incident Log'!C221=\"\",\"\",'Incident Log'!C221)","v":""},{"$f":"IFERROR(INDEX($A$11:$A$500, MATCH(0, COUNTIF($B$10:B220, $A$11:$A$500), 0)),\"\")","v":""},{"$f":"IF(B221=\"\",\"\",COUNTIF('Incident Log'!$C$11:$C$500,B221))","v":""},{"$f":"IF(B221=\"\",\"\",RANK(C221,$C$11:$C$500)+COUNTIF($C$11:C221,C221)-1)","v":""},"","",""]
[{"$f":"IF('Incident Log'!C222=\"\",\"\",'Incident Log'!C222)","v":""},{"$f":"IFERROR(INDEX($A$11:$A$500, MATCH(0, COUNTIF($B$10:B221, $A$11:$A$500), 0)),\"\")","v":""},{"$f":"IF(B222=\"\",\"\",COUNTIF('Incident Log'!$C$11:$C$500,B222))","v":""},{"$f":"IF(B222=\"\",\"\",RANK(C222,$C$11:$C$500)+COUNTIF($C$11:C222,C222)-1)","v":""},"","",""]
[{"$f":"IF('Incident Log'!C223=\"\",\"\",'Incident Log'!C223)","v":""},{"$f":"IFERROR(INDEX($A$11:$A$500, MATCH(0, COUNTIF($B$10:B222, $A$11:$A$500), 0)),\"\")","v":""},{"$f":"IF(B223=\"\",\"\",COUNTIF('Incident Log'!$C$11:$C$500,B223))","v":""},{"$f":"IF(B223=\"\",\"\",RANK(C223,$C$11:$C$500)+COUNTIF($C$11:C223,C223)-1)","v":""},"","",""]
[{"$f":"IF('Incident Log'!C224=\"\",\"\",'Incident Log'!C224)","v":""},{"$f":"IFERROR(INDEX($A$11:$A$500, MATCH(0, COUNTIF($B$10:B223, $A$11:$A$500), 0)),\"\")","v":""},{"$f":"IF(B224=\"\",\"\",COUNTIF('Incident Log'!$C$11:$C$500,B224))","v":""},{"$f":"IF(B224=\"\",\"\",RANK(C224,$C$11:$C$500)+COUNTIF($C$11:C224,C224)-1)","v":""},"","",""]
[{"$f":"IF('Incident Log'!C225=\"\",\"\",'Incident Log'!C225)","v":""},{"$f":"IFERROR(INDEX($A$11:$A$500, MATCH(0, COUNTIF($B$10:B224, $A$11:$A$500), 0)),\"\")","v":""},{"$f":"IF(B225=\"\",\"\",COUNTIF('Incident Log'!$C$11:$C$500,B225))","v":""},{"$f":"IF(B225=\"\",\"\",RANK(C225,$C$11:$C$500)+COUNTIF($C$11:C225,C225)-1)","v":""},"","",""]
[{"$f":"IF('Incident Log'!C226=\"\",\"\",'Incident Log'!C226)","v":""},{"$f":"IFERROR(INDEX($A$11:$A$500, MATCH(0, COUNTIF($B$10:B225, $A$11:$A$500), 0)),\"\")","v":""},{"$f":"IF(B226=\"\",\"\",COUNTIF('Incident Log'!$C$11:$C$500,B226))","v":""},{"$f":"IF(B226=\"\",\"\",RANK(C226,$C$11:$C$500)+COUNTIF($C$11:C226,C226)-1)","v":""},"","",""]
[{"$f":"IF('Incident Log'!C227=\"\",\"\",'Incident Log'!C227)","v":""},{"$f":"IFERROR(INDEX($A$11:$A$500, MATCH(0, COUNTIF($B$10:B226, $A$11:$A$500), 0)),\"\")","v":""},{"$f":"IF(B227=\"\",\"\",COUNTIF('Incident Log'!$C$11:$C$500,B227))","v":""},{"$f":"IF(B227=\"\",\"\",RANK(C227,$C$11:$C$500)+COUNTIF($C$11:C227,C227)-1)","v":""},"","",""]
[{"$f":"IF('Incident Log'!C228=\"\",\"\",'Incident Log'!C228)","v":""},{"$f":"IFERROR(INDEX($A$11:$A$500, MATCH(0, COUNTIF($B$10:B227, $A$11:$A$500), 0)),\"\")","v":""},{"$f":"IF(B228=\"\",\"\",COUNTIF('Incident Log'!$C$11:$C$500,B228))","v":""},{"$f":"IF(B228=\"\",\"\",RANK(C228,$C$11:$C$500)+COUNTIF($C$11:C228,C228)-1)","v":""},"","",""]
[{"$f":"IF('Incident Log'!C229=\"\",\"\",'Incident Log'!C229)","v":""},{"$f":"IFERROR(INDEX($A$11:$A$500, MATCH(0, COUNTIF($B$10:B228, $A$11:$A$500), 0)),\"\")","v":""},{"$f":"IF(B229=\"\",\"\",COUNTIF('Incident Log'!$C$11:$C$500,B229))","v":""},{"$f":"IF(B229=\"\",\"\",RANK(C229,$C$11:$C$500)+COUNTIF($C$11:C229,C229)-1)","v":""},"","",""]
[{"$f":"IF('Incident Log'!C230=\"\",\"\",'Incident Log'!C230)","v":""},{"$f":"IFERROR(INDEX($A$11:$A$500, MATCH(0, COUNTIF($B$10:B229, $A$11:$A$500), 0)),\"\")","v":""},{"$f":"IF(B230=\"\",\"\",COUNTIF('Incident Log'!$C$11:$C$500,B230))","v":""},{"$f":"IF(B230=\"\",\"\",RANK(C230,$C$11:$C$500)+COUNTIF($C$11:C230,C230)-1)","v":""},"","",""]
[{"$f":"IF('Incident Log'!C231=\"\",\"\",'Incident Log'!C231)","v":""},{"$f":"IFERROR(INDEX($A$11:$A$500, MATCH(0, COUNTIF($B$10:B230, $A$11:$A$500), 0)),\"\")","v":""},{"$f":"IF(B231=\"\",\"\",COUNTIF('Incident Log'!$C$11:$C$500,B231))","v":""},{"$f":"IF(B231=\"\",\"\",RANK(C231,$C$11:$C$500)+COUNTIF($C$11:C231,C231)-1)","v":""},"","",""]
[{"$f":"IF('Incident Log'!C232=\"\",\"\",'Incident Log'!C232)","v":""},{"$f":"IFERROR(INDEX($A$11:$A$500, MATCH(0, COUNTIF($B$10:B231, $A$11:$A$500), 0)),\"\")","v":""},{"$f":"IF(B232=\"\",\"\",COUNTIF('Incident Log'!$C$11:$C$500,B232))","v":""},{"$f":"IF(B232=\"\",\"\",RANK(C232,$C$11:$C$500)+COUNTIF($C$11:C232,C232)-1)","v":""},"","",""]
[{"$f":"IF('Incident Log'!C233=\"\",\"\",'Incident Log'!C233)","v":""},{"$f":"IFERROR(INDEX($A$11:$A$500, MATCH(0, COUNTIF($B$10:B232, $A$11:$A$500), 0)),\"\")","v":""},{"$f":"IF(B233=\"\",\"\",COUNTIF('Incident Log'!$C$11:$C$500,B233))","v":""},{"$f":"IF(B233=\"\",\"\",RANK(C233,$C$11:$C$500)+COUNTIF($C$11:C233,C233)-1)","v":""},"","",""]
[{"$f":"IF('Incident Log'!C234=\"\",\"\",'Incident Log'!C234)","v":""},{"$f":"IFERROR(INDEX($A$11:$A$500, MATCH(0, COUNTIF($B$10:B233, $A$11:$A$500), 0)),\"\")","v":""},{"$f":"IF(B234=\"\",\"\",COUNTIF('Incident Log'!$C$11:$C$500,B234))","v":""},{"$f":"IF(B234=\"\",\"\",RANK(C234,$C$11:$C$500)+COUNTIF($C$11:C234,C234)-1)","v":""},"","",""]
[{"$f":"IF('Incident Log'!C235=\"\",\"\",'Incident Log'!C235)","v":""},{"$f":"IFERROR(INDEX($A$11:$A$500, MATCH(0, COUNTIF($B$10:B234, $A$11:$A$500), 0)),\"\")","v":""},{"$f":"IF(B235=\"\",\"\",COUNTIF('Incident Log'!$C$11:$C$500,B235))","v":""},{"$f":"IF(B235=\"\",\"\",RANK(C235,$C$11:$C$500)+COUNTIF($C$11:C235,C235)-1)","v":""},"","",""]
[{"$f":"IF('Incident Log'!C236=\"\",\"\",'Incident Log'!C236)","v":""},{"$f":"IFERROR(INDEX($A$11:$A$500, MATCH(0, COUNTIF($B$10:B235, $A$11:$A$500), 0)),\"\")","v":""},{"$f":"IF(B236=\"\",\"\",COUNTIF('Incident Log'!$C$11:$C$500,B236))","v":""},{"$f":"IF(B236=\"\",\"\",RANK(C236,$C$11:$C$500)+COUNTIF($C$11:C236,C236)-1)","v":""},"","",""]
[{"$f":"IF('Incident Log'!C237=\"\",\"\",'Incident Log'!C237)","v":""},{"$f":"IFERROR(INDEX($A$11:$A$500, MATCH(0, COUNTIF($B$10:B236, $A$11:$A$500), 0)),\"\")","v":""},{"$f":"IF(B237=\"\",\"\",COUNTIF('Incident Log'!$C$11:$C$500,B237))","v":""},{"$f":"IF(B237=\"\",\"\",RANK(C237,$C$11:$C$500)+COUNTIF($C$11:C237,C237)-1)","v":""},"","",""]
[{"$f":"IF('Incident Log'!C238=\"\",\"\",'Incident Log'!C238)","v":""},{"$f":"IFERROR(INDEX($A$11:$A$500, MATCH(0, COUNTIF($B$10:B237, $A$11:$A$500), 0)),\"\")","v":""},{"$f":"IF(B238=\"\",\"\",COUNTIF('Incident Log'!$C$11:$C$500,B238))","v":""},{"$f":"IF(B238=\"\",\"\",RANK(C238,$C$11:$C$500)+COUNTIF($C$11:C238,C238)-1)","v":""},"","",""]
[{"$f":"IF('Incident Log'!C239=\"\",\"\",'Incident Log'!C239)","v":""},{"$f":"IFERROR(INDEX($A$11:$A$500, MATCH(0, COUNTIF($B$10:B238, $A$11:$A$500), 0)),\"\")","v":""},{"$f":"IF(B239=\"\",\"\",COUNTIF('Incident Log'!$C$11:$C$500,B239))","v":""},{"$f":"IF(B239=\"\",\"\",RANK(C239,$C$11:$C$500)+COUNTIF($C$11:C239,C239)-1)","v":""},"","",""]
[{"$f":"IF('Incident Log'!C240=\"\",\"\",'Incident Log'!C240)","v":""},{"$f":"IFERROR(INDEX($A$11:$A$500, MATCH(0, COUNTIF($B$10:B239, $A$11:$A$500), 0)),\"\")","v":""},{"$f":"IF(B240=\"\",\"\",COUNTIF('Incident Log'!$C$11:$C$500,B240))","v":""},{"$f":"IF(B240=\"\",\"\",RANK(C240,$C$11:$C$500)+COUNTIF($C$11:C240,C240)-1)","v":""},"","",""]
[{"$f":"IF('Incident Log'!C241=\"\",\"\",'Incident Log'!C241)","v":""},{"$f":"IFERROR(INDEX($A$11:$A$500, MATCH(0, COUNTIF($B$10:B240, $A$11:$A$500), 0)),\"\")","v":""},{"$f":"IF(B241=\"\",\"\",COUNTIF('Incident Log'!$C$11:$C$500,B241))","v":""},{"$f":"IF(B241=\"\",\"\",RANK(C241,$C$11:$C$500)+COUNTIF($C$11:C241,C241)-1)","v":""},"","",""]
[{"$f":"IF('Incident Log'!C242=\"\",\"\",'Incident Log'!C242)","v":""},{"$f":"IFERROR(INDEX($A$11:$A$500, MATCH(0, COUNTIF($B$10:B241, $A$11:$A$500), 0)),\"\")","v":""},{"$f":"IF(B242=\"\",\"\",COUNTIF('Incident Log'!$C$11:$C$500,B242))","v":""},{"$f":"IF(B242=\"\",\"\",RANK(C242,$C$11:$C$500)+COUNTIF($C$11:C242,C242)-1)","v":""},"","",""]
[{"$f":"IF('Incident Log'!C243=\"\",\"\",'Incident Log'!C243)","v":""},{"$f":"IFERROR(INDEX($A$11:$A$500, MATCH(0, COUNTIF($B$10:B242, $A$11:$A$500), 0)),\"\")","v":""},{"$f":"IF(B243=\"\",\"\",COUNTIF('Incident Log'!$C$11:$C$500,B243))","v":""},{"$f":"IF(B243=\"\",\"\",RANK(C243,$C$11:$C$500)+COUNTIF($C$11:C243,C243)-1)","v":""},"","",""]
[{"$f":"IF('Incident Log'!C244=\"\",\"\",'Incident Log'!C244)","v":""},{"$f":"IFERROR(INDEX($A$11:$A$500, MATCH(0, COUNTIF($B$10:B243, $A$11:$A$500), 0)),\"\")","v":""},{"$f":"IF(B244=\"\",\"\",COUNTIF('Incident Log'!$C$11:$C$500,B244))","v":""},{"$f":"IF(B244=\"\",\"\",RANK(C244,$C$11:$C$500)+COUNTIF($C$11:C244,C244)-1)","v":""},"","",""]
[{"$f":"IF('Incident Log'!C245=\"\",\"\",'Incident Log'!C245)","v":""},{"$f":"IFERROR(INDEX($A$11:$A$500, MATCH(0, COUNTIF($B$10:B244, $A$11:$A$500), 0)),\"\")","v":""},{"$f":"IF(B245=\"\",\"\",COUNTIF('Incident Log'!$C$11:$C$500,B245))","v":""},{"$f":"IF(B245=\"\",\"\",RANK(C245,$C$11:$C$500)+COUNTIF($C$11:C245,C245)-1)","v":""},"","",""]
[{"$f":"IF('Incident Log'!C246=\"\",\"\",'Incident Log'!C246)","v":""},{"$f":"IFERROR(INDEX($A$11:$A$500, MATCH(0, COUNTIF($B$10:B245, $A$11:$A$500), 0)),\"\")","v":""},{"$f":"IF(B246=\"\",\"\",COUNTIF('Incident Log'!$C$11:$C$500,B246))","v":""},{"$f":"IF(B246=\"\",\"\",RANK(C246,$C$11:$C$500)+COUNTIF($C$11:C246,C246)-1)","v":""},"","",""]
[{"$f":"IF('Incident Log'!C247=\"\",\"\",'Incident Log'!C247)","v":""},{"$f":"IFERROR(INDEX($A$11:$A$500, MATCH(0, COUNTIF($B$10:B246, $A$11:$A$500), 0)),\"\")","v":""},{"$f":"IF(B247=\"\",\"\",COUNTIF('Incident Log'!$C$11:$C$500,B247))","v":""},{"$f":"IF(B247=\"\",\"\",RANK(C247,$C$11:$C$500)+COUNTIF($C$11:C247,C247)-1)","v":""},"","",""]
[{"$f":"IF('Incident Log'!C248=\"\",\"\",'Incident Log'!C248)","v":""},{"$f":"IFERROR(INDEX($A$11:$A$500, MATCH(0, COUNTIF($B$10:B247, $A$11:$A$500), 0)),\"\")","v":""},{"$f":"IF(B248=\"\",\"\",COUNTIF('Incident Log'!$C$11:$C$500,B248))","v":""},{"$f":"IF(B248=\"\",\"\",RANK(C248,$C$11:$C$500)+COUNTIF($C$11:C248,C248)-1)","v":""},"","",""]
[{"$f":"IF('Incident Log'!C249=\"\",\"\",'Incident Log'!C249)","v":""},{"$f":"IFERROR(INDEX($A$11:$A$500, MATCH(0, COUNTIF($B$10:B248, $A$11:$A$500), 0)),\"\")","v":""},{"$f":"IF(B249=\"\",\"\",COUNTIF('Incident Log'!$C$11:$C$500,B249))","v":""},{"$f":"IF(B249=\"\",\"\",RANK(C249,$C$11:$C$500)+COUNTIF($C$11:C249,C249)-1)","v":""},"","",""]
[{"$f":"IF('Incident Log'!C250=\"\",\"\",'Incident Log'!C250)","v":""},{"$f":"IFERROR(INDEX($A$11:$A$500, MATCH(0, COUNTIF($B$10:B249, $A$11:$A$500), 0)),\"\")","v":""},{"$f":"IF(B250=\"\",\"\",COUNTIF('Incident Log'!$C$11:$C$500,B250))","v":""},{"$f":"IF(B250=\"\",\"\",RANK(C250,$C$11:$C$500)+COUNTIF($C$11:C250,C250)-1)","v":""},"","",""]
[{"$f":"IF('Incident Log'!C251=\"\",\"\",'Incident Log'!C251)","v":""},{"$f":"IFERROR(INDEX($A$11:$A$500, MATCH(0, COUNTIF($B$10:B250, $A$11:$A$500), 0)),\"\")","v":""},{"$f":"IF(B251=\"\",\"\",COUNTIF('Incident Log'!$C$11:$C$500,B251))","v":""},{"$f":"IF(B251=\"\",\"\",RANK(C251,$C$11:$C$500)+COUNTIF($C$11:C251,C251)-1)","v":""},"","",""]
[{"$f":"IF('Incident Log'!C252=\"\",\"\",'Incident Log'!C252)","v":""},{"$f":"IFERROR(INDEX($A$11:$A$500, MATCH(0, COUNTIF($B$10:B251, $A$11:$A$500), 0)),\"\")","v":""},{"$f":"IF(B252=\"\",\"\",COUNTIF('Incident Log'!$C$11:$C$500,B252))","v":""},{"$f":"IF(B252=\"\",\"\",RANK(C252,$C$11:$C$500)+COUNTIF($C$11:C252,C252)-1)","v":""},"","",""]
[{"$f":"IF('Incident Log'!C253=\"\",\"\",'Incident Log'!C253)","v":""},{"$f":"IFERROR(INDEX($A$11:$A$500, MATCH(0, COUNTIF($B$10:B252, $A$11:$A$500), 0)),\"\")","v":""},{"$f":"IF(B253=\"\",\"\",COUNTIF('Incident Log'!$C$11:$C$500,B253))","v":""},{"$f":"IF(B253=\"\",\"\",RANK(C253,$C$11:$C$500)+COUNTIF($C$11:C253,C253)-1)","v":""},"","",""]
[{"$f":"IF('Incident Log'!C254=\"\",\"\",'Incident Log'!C254)","v":""},{"$f":"IFERROR(INDEX($A$11:$A$500, MATCH(0, COUNTIF($B$10:B253, $A$11:$A$500), 0)),\"\")","v":""},{"$f":"IF(B254=\"\",\"\",COUNTIF('Incident Log'!$C$11:$C$500,B254))","v":""},{"$f":"IF(B254=\"\",\"\",RANK(C254,$C$11:$C$500)+COUNTIF($C$11:C254,C254)-1)","v":""},"","",""]
[{"$f":"IF('Incident Log'!C255=\"\",\"\",'Incident Log'!C255)","v":""},{"$f":"IFERROR(INDEX($A$11:$A$500, MATCH(0, COUNTIF($B$10:B254, $A$11:$A$500), 0)),\"\")","v":""},{"$f":"IF(B255=\"\",\"\",COUNTIF('Incident Log'!$C$11:$C$500,B255))","v":""},{"$f":"IF(B255=\"\",\"\",RANK(C255,$C$11:$C$500)+COUNTIF($C$11:C255,C255)-1)","v":""},"","",""]
[{"$f":"IF('Incident Log'!C256=\"\",\"\",'Incident Log'!C256)","v":""},{"$f":"IFERROR(INDEX($A$11:$A$500, MATCH(0, COUNTIF($B$10:B255, $A$11:$A$500), 0)),\"\")","v":""},{"$f":"IF(B256=\"\",\"\",COUNTIF('Incident Log'!$C$11:$C$500,B256))","v":""},{"$f":"IF(B256=\"\",\"\",RANK(C256,$C$11:$C$500)+COUNTIF($C$11:C256,C256)-1)","v":""},"","",""]
[{"$f":"IF('Incident Log'!C257=\"\",\"\",'Incident Log'!C257)","v":""},{"$f":"IFERROR(INDEX($A$11:$A$500, MATCH(0, COUNTIF($B$10:B256, $A$11:$A$500), 0)),\"\")","v":""},{"$f":"IF(B257=\"\",\"\",COUNTIF('Incident Log'!$C$11:$C$500,B257))","v":""},{"$f":"IF(B257=\"\",\"\",RANK(C257,$C$11:$C$500)+COUNTIF($C$11:C257,C257)-1)","v":""},"","",""]
[{"$f":"IF('Incident Log'!C258=\"\",\"\",'Incident Log'!C258)","v":""},{"$f":"IFERROR(INDEX($A$11:$A$500, MATCH(0, COUNTIF($B$10:B257, $A$11:$A$500), 0)),\"\")","v":""},{"$f":"IF(B258=\"\",\"\",COUNTIF('Incident Log'!$C$11:$C$500,B258))","v":""},{"$f":"IF(B258=\"\",\"\",RANK(C258,$C$11:$C$500)+COUNTIF($C$11:C258,C258)-1)","v":""},"","",""]
[{"$f":"IF('Incident Log'!C259=\"\",\"\",'Incident Log'!C259)","v":""},{"$f":"IFERROR(INDEX($A$11:$A$500, MATCH(0, COUNTIF($B$10:B258, $A$11:$A$500), 0)),\"\")","v":""},{"$f":"IF(B259=\"\",\"\",COUNTIF('Incident Log'!$C$11:$C$500,B259))","v":""},{"$f":"IF(B259=\"\",\"\",RANK(C259,$C$11:$C$500)+COUNTIF($C$11:C259,C259)-1)","v":""},"","",""]
[{"$f":"IF('Incident Log'!C260=\"\",\"\",'Incident Log'!C260)","v":""},{"$f":"IFERROR(INDEX($A$11:$A$500, MATCH(0, COUNTIF($B$10:B259, $A$11:$A$500), 0)),\"\")","v":""},{"$f":"IF(B260=\"\",\"\",COUNTIF('Incident Log'!$C$11:$C$500,B260))","v":""},{"$f":"IF(B260=\"\",\"\",RANK(C260,$C$11:$C$500)+COUNTIF($C$11:C260,C260)-1)","v":""},"","",""]
[{"$f":"IF('Incident Log'!C261=\"\",\"\",'Incident Log'!C261)","v":""},{"$f":"IFERROR(INDEX($A$11:$A$500, MATCH(0, COUNTIF($B$10:B260, $A$11:$A$500), 0)),\"\")","v":""},{"$f":"IF(B261=\"\",\"\",COUNTIF('Incident Log'!$C$11:$C$500,B261))","v":""},{"$f":"IF(B261=\"\",\"\",RANK(C261,$C$11:$C$500)+COUNTIF($C$11:C261,C261)-1)","v":""},"","",""]
[{"$f":"IF('Incident Log'!C262=\"\",\"\",'Incident Log'!C262)","v":""},{"$f":"IFERROR(INDEX($A$11:$A$500, MATCH(0, COUNTIF($B$10:B261, $A$11:$A$500), 0)),\"\")","v":""},{"$f":"IF(B262=\"\",\"\",COUNTIF('Incident Log'!$C$11:$C$500,B262))","v":""},{"$f":"IF(B262=\"\",\"\",RANK(C262,$C$11:$C$500)+COUNTIF($C$11:C262,C262)-1)","v":""},"","",""]
[{"$f":"IF('Incident Log'!C263=\"\",\"\",'Incident Log'!C263)","v":""},{"$f":"IFERROR(INDEX($A$11:$A$500, MATCH(0, COUNTIF($B$10:B262, $A$11:$A$500), 0)),\"\")","v":""},{"$f":"IF(B263=\"\",\"\",COUNTIF('Incident Log'!$C$11:$C$500,B263))","v":""},{"$f":"IF(B263=\"\",\"\",RANK(C263,$C$11:$C$500)+COUNTIF($C$11:C263,C263)-1)","v":""},"","",""]
[{"$f":"IF('Incident Log'!C264=\"\",\"\",'Incident Log'!C264)","v":""},{"$f":"IFERROR(INDEX($A$11:$A$500, MATCH(0, COUNTIF($B$10:B263, $A$11:$A$500), 0)),\"\")","v":""},{"$f":"IF(B264=\"\",\"\",COUNTIF('Incident Log'!$C$11:$C$500,B264))","v":""},{"$f":"IF(B264=\"\",\"\",RANK(C264,$C$11:$C$500)+COUNTIF($C$11:C264,C264)-1)","v":""},"","",""]
[{"$f":"IF('Incident Log'!C265=\"\",\"\",'Incident Log'!C265)","v":""},{"$f":"IFERROR(INDEX($A$11:$A$500, MATCH(0, COUNTIF($B$10:B264, $A$11:$A$500), 0)),\"\")","v":""},{"$f":"IF(B265=\"\",\"\",COUNTIF('Incident Log'!$C$11:$C$500,B265))","v":""},{"$f":"IF(B265=\"\",\"\",RANK(C265,$C$11:$C$500)+COUNTIF($C$11:C265,C265)-1)","v":""},"","",""]
[{"$f":"IF('Incident Log'!C266=\"\",\"\",'Incident Log'!C266)","v":""},{"$f":"IFERROR(INDEX($A$11:$A$500, MATCH(0, COUNTIF($B$10:B265, $A$11:$A$500), 0)),\"\")","v":""},{"$f":"IF(B266=\"\",\"\",COUNTIF('Incident Log'!$C$11:$C$500,B266))","v":""},{"$f":"IF(B266=\"\",\"\",RANK(C266,$C$11:$C$500)+COUNTIF($C$11:C266,C266)-1)","v":""},"","",""]
[{"$f":"IF('Incident Log'!C267=\"\",\"\",'Incident Log'!C267)","v":""},{"$f":"IFERROR(INDEX($A$11:$A$500, MATCH(0, COUNTIF($B$10:B266, $A$11:$A$500), 0)),\"\")","v":""},{"$f":"IF(B267=\"\",\"\",COUNTIF('Incident Log'!$C$11:$C$500,B267))","v":""},{"$f":"IF(B267=\"\",\"\",RANK(C267,$C$11:$C$500)+COUNTIF($C$11:C267,C267)-1)","v":""},"","",""]
[{"$f":"IF('Incident Log'!C268=\"\",\"\",'Incident Log'!C268)","v":""},{"$f":"IFERROR(INDEX($A$11:$A$500, MATCH(0, COUNTIF($B$10:B267, $A$11:$A$500), 0)),\"\")","v":""},{"$f":"IF(B268=\"\",\"\",COUNTIF('Incident Log'!$C$11:$C$500,B268))","v":""},{"$f":"IF(B268=\"\",\"\",RANK(C268,$C$11:$C$500)+COUNTIF($C$11:C268,C268)-1)","v":""},"",{"$f":"IF(B268=\"\",\"\",INDEX($B$11:$B$500,MATCH(E268,$D$11:$D$500,0)))","v":""},{"$f":"IF(B268=\"\",\"\",VLOOKUP(F268,$B$11:$C$500,2,FALSE))","v":""}]
[{"$f":"IF('Incident Log'!C269=\"\",\"\",'Incident Log'!C269)","v":""},{"$f":"IFERROR(INDEX($A$11:$A$500, MATCH(0, COUNTIF($B$10:B268, $A$11:$A$500), 0)),\"\")","v":""},{"$f":"IF(B269=\"\",\"\",COUNTIF('Incident Log'!$C$11:$C$500,B269))","v":""},{"$f":"IF(B269=\"\",\"\",RANK(C269,$C$11:$C$500)+COUNTIF($C$11:C269,C269)-1)","v":""},"","",""]
[{"$f":"IF('Incident Log'!C270=\"\",\"\",'Incident Log'!C270)","v":""},{"$f":"IFERROR(INDEX($A$11:$A$500, MATCH(0, COUNTIF($B$10:B269, $A$11:$A$500), 0)),\"\")","v":""},{"$f":"IF(B270=\"\",\"\",COUNTIF('Incident Log'!$C$11:$C$500,B270))","v":""},{"$f":"IF(B270=\"\",\"\",RANK(C270,$C$11:$C$500)+COUNTIF($C$11:C270,C270)-1)","v":""},{"$f":"IF(B270=\"\",\"\",1+E269)","v":""},"",""]
[{"$f":"IF('Incident Log'!C271=\"\",\"\",'Incident Log'!C271)","v":""},{"$f":"IFERROR(INDEX($A$11:$A$500, MATCH(0, COUNTIF($B$10:B270, $A$11:$A$500), 0)),\"\")","v":""},{"$f":"IF(B271=\"\",\"\",COUNTIF('Incident Log'!$C$11:$C$500,B271))","v":""},{"$f":"IF(B271=\"\",\"\",RANK(C271,$C$11:$C$500)+COUNTIF($C$11:C271,C271)-1)","v":""},"","",""]
[{"$f":"IF('Incident Log'!C272=\"\",\"\",'Incident Log'!C272)","v":""},{"$f":"IFERROR(INDEX($A$11:$A$500, MATCH(0, COUNTIF($B$10:B271, $A$11:$A$500), 0)),\"\")","v":""},{"$f":"IF(B272=\"\",\"\",COUNTIF('Incident Log'!$C$11:$C$500,B272))","v":""},{"$f":"IF(B272=\"\",\"\",RANK(C272,$C$11:$C$500)+COUNTIF($C$11:C272,C272)-1)","v":""},"","",""]
[{"$f":"IF('Incident Log'!C273=\"\",\"\",'Incident Log'!C273)","v":""},{"$f":"IFERROR(INDEX($A$11:$A$500, MATCH(0, COUNTIF($B$10:B272, $A$11:$A$500), 0)),\"\")","v":""},{"$f":"IF(B273=\"\",\"\",COUNTIF('Incident Log'!$C$11:$C$500,B273))","v":""},{"$f":"IF(B273=\"\",\"\",RANK(C273,$C$11:$C$500)+COUNTIF($C$11:C273,C273)-1)","v":""},"","",""]
[{"$f":"IF('Incident Log'!C274=\"\",\"\",'Incident Log'!C274)","v":""},{"$f":"IFERROR(INDEX($A$11:$A$500, MATCH(0, COUNTIF($B$10:B273, $A$11:$A$500), 0)),\"\")","v":""},{"$f":"IF(B274=\"\",\"\",COUNTIF('Incident Log'!$C$11:$C$500,B274))","v":""},{"$f":"IF(B274=\"\",\"\",RANK(C274,$C$11:$C$500)+COUNTIF($C$11:C274,C274)-1)","v":""},"","",""]
[{"$f":"IF('Incident Log'!C275=\"\",\"\",'Incident Log'!C275)","v":""},{"$f":"IFERROR(INDEX($A$11:$A$500, MATCH(0, COUNTIF($B$10:B274, $A$11:$A$500), 0)),\"\")","v":""},{"$f":"IF(B275=\"\",\"\",COUNTIF('Incident Log'!$C$11:$C$500,B275))","v":""},{"$f":"IF(B275=\"\",\"\",RANK(C275,$C$11:$C$500)+COUNTIF($C$11:C275,C275)-1)","v":""},"","",""]
[{"$f":"IF('Incident Log'!C276=\"\",\"\",'Incident Log'!C276)","v":""},{"$f":"IFERROR(INDEX($A$11:$A$500, MATCH(0, COUNTIF($B$10:B275, $A$11:$A$500), 0)),\"\")","v":""},{"$f":"IF(B276=\"\",\"\",COUNTIF('Incident Log'!$C$11:$C$500,B276))","v":""},{"$f":"IF(B276=\"\",\"\",RANK(C276,$C$11:$C$500)+COUNTIF($C$11:C276,C276)-1)","v":""},"","",""]
[{"$f":"IF('Incident Log'!C277=\"\",\"\",'Incident Log'!C277)","v":""},{"$f":"IFERROR(INDEX($A$11:$A$500, MATCH(0, COUNTIF($B$10:B276, $A$11:$A$500), 0)),\"\")","v":""},{"$f":"IF(B277=\"\",\"\",COUNTIF('Incident Log'!$C$11:$C$500,B277))","v":""},{"$f":"IF(B277=\"\",\"\",RANK(C277,$C$11:$C$500)+COUNTIF($C$11:C277,C277)-1)","v":""},"","",""]
[{"$f":"IF('Incident Log'!C278=\"\",\"\",'Incident Log'!C278)","v":""},{"$f":"IFERROR(INDEX($A$11:$A$500, MATCH(0, COUNTIF($B$10:B277, $A$11:$A$500), 0)),\"\")","v":""},{"$f":"IF(B278=\"\",\"\",COUNTIF('Incident Log'!$C$11:$C$500,B278))","v":""},{"$f":"IF(B278=\"\",\"\",RANK(C278,$C$11:$C$500)+COUNTIF($C$11:C278,C278)-1)","v":""},"","",""]
[{"$f":"IF('Incident Log'!C279=\"\",\"\",'Incident Log'!C279)","v":""},{"$f":"IFERROR(INDEX($A$11:$A$500, MATCH(0, COUNTIF($B$10:B278, $A$11:$A$500), 0)),\"\")","v":""},{"$f":"IF(B279=\"\",\"\",COUNTIF('Incident Log'!$C$11:$C$500,B279))","v":""},{"$f":"IF(B279=\"\",\"\",RANK(C279,$C$11:$C$500)+COUNTIF($C$11:C279,C279)-1)","v":""},"","",""]
[{"$f":"IF('Incident Log'!C280=\"\",\"\",'Incident Log'!C280)","v":""},{"$f":"IFERROR(INDEX($A$11:$A$500, MATCH(0, COUNTIF($B$10:B279, $A$11:$A$500), 0)),\"\")","v":""},{"$f":"IF(B280=\"\",\"\",COUNTIF('Incident Log'!$C$11:$C$500,B280))","v":""},{"$f":"IF(B280=\"\",\"\",RANK(C280,$C$11:$C$500)+COUNTIF($C$11:C280,C280)-1)","v":""},"","",""]
[{"$f":"IF('Incident Log'!C281=\"\",\"\",'Incident Log'!C281)","v":""},{"$f":"IFERROR(INDEX($A$11:$A$500, MATCH(0, COUNTIF($B$10:B280, $A$11:$A$500), 0)),\"\")","v":""},{"$f":"IF(B281=\"\",\"\",COUNTIF('Incident Log'!$C$11:$C$500,B281))","v":""},{"$f":"IF(B281=\"\",\"\",RANK(C281,$C$11:$C$500)+COUNTIF($C$11:C281,C281)-1)","v":""},"","",""]
[{"$f":"IF('Incident Log'!C282=\"\",\"\",'Incident Log'!C282)","v":""},{"$f":"IFERROR(INDEX($A$11:$A$500, MATCH(0, COUNTIF($B$10:B281, $A$11:$A$500), 0)),\"\")","v":""},{"$f":"IF(B282=\"\",\"\",COUNTIF('Incident Log'!$C$11:$C$500,B282))","v":""},{"$f":"IF(B282=\"\",\"\",RANK(C282,$C$11:$C$500)+COUNTIF($C$11:C282,C282)-1)","v":""},"","",""]
[{"$f":"IF('Incident Log'!C283=\"\",\"\",'Incident Log'!C283)","v":""},{"$f":"IFERROR(INDEX($A$11:$A$500, MATCH(0, COUNTIF($B$10:B282, $A$11:$A$500), 0)),\"\")","v":""},{"$f":"IF(B283=\"\",\"\",COUNTIF('Incident Log'!$C$11:$C$500,B283))","v":""},{"$f":"IF(B283=\"\",\"\",RANK(C283,$C$11:$C$500)+COUNTIF($C$11:C283,C283)-1)","v":""},"","",""]
[{"$f":"IF('Incident Log'!C284=\"\",\"\",'Incident Log'!C284)","v":""},{"$f":"IFERROR(INDEX($A$11:$A$500, MATCH(0, COUNTIF($B$10:B283, $A$11:$A$500), 0)),\"\")","v":""},{"$f":"IF(B284=\"\",\"\",COUNTIF('Incident Log'!$C$11:$C$500,B284))","v":""},{"$f":"IF(B284=\"\",\"\",RANK(C284,$C$11:$C$500)+COUNTIF($C$11:C284,C284)-1)","v":""},"","",""]
[{"$f":"IF('Incident Log'!C285=\"\",\"\",'Incident Log'!C285)","v":""},{"$f":"IFERROR(INDEX($A$11:$A$500, MATCH(0, COUNTIF($B$10:B284, $A$11:$A$500), 0)),\"\")","v":""},{"$f":"IF(B285=\"\",\"\",COUNTIF('Incident Log'!$C$11:$C$500,B285))","v":""},{"$f":"IF(B285=\"\",\"\",RANK(C285,$C$11:$C$500)+COUNTIF($C$11:C285,C285)-1)","v":""},"","",""]
[{"$f":"IF('Incident Log'!C286=\"\",\"\",'Incident Log'!C286)","v":""},{"$f":"IFERROR(INDEX($A$11:$A$500, MATCH(0, COUNTIF($B$10:B285, $A$11:$A$500), 0)),\"\")","v":""},{"$f":"IF(B286=\"\",\"\",COUNTIF('Incident Log'!$C$11:$C$500,B286))","v":""},{"$f":"IF(B286=\"\",\"\",RANK(C286,$C$11:$C$500)+COUNTIF($C$11:C286,C286)-1)","v":""},"","",""]
[{"$f":"IF('Incident Log'!C287=\"\",\"\",'Incident Log'!C287)","v":""},{"$f":"IFERROR(INDEX($A$11:$A$500, MATCH(0, COUNTIF($B$10:B286, $A$11:$A$500), 0)),\"\")","v":""},{"$f":"IF(B287=\"\",\"\",COUNTIF('Incident Log'!$C$11:$C$500,B287))","v":""},{"$f":"IF(B287=\"\",\"\",RANK(C287,$C$11:$C$500)+COUNTIF($C$11:C287,C287)-1)","v":""},"","",""]
[{"$f":"IF('Incident Log'!C288=\"\",\"\",'Incident Log'!C288)","v":""},{"$f":"IFERROR(INDEX($A$11:$A$500, MATCH(0, COUNTIF($B$10:B287, $A$11:$A$500), 0)),\"\")","v":""},{"$f":"IF(B288=\"\",\"\",COUNTIF('Incident Log'!$C$11:$C$500,B288))","v":""},{"$f":"IF(B288=\"\",\"\",RANK(C288,$C$11:$C$500)+COUNTIF($C$11:C288,C288)-1)","v":""},"","",""]
[{"$f":"IF('Incident Log'!C289=\"\",\"\",'Incident Log'!C289)","v":""},{"$f":"IFERROR(INDEX($A$11:$A$500, MATCH(0, COUNTIF($B$10:B288, $A$11:$A$500), 0)),\"\")","v":""},{"$f":"IF(B289=\"\",\"\",COUNTIF('Incident Log'!$C$11:$C$500,B289))","v":""},{"$f":"IF(B289=\"\",\"\",RANK(C289,$C$11:$C$500)+COUNTIF($C$11:C289,C289)-1)","v":""},"","",""]
[{"$f":"IF('Incident Log'!C290=\"\",\"\",'Incident Log'!C290)","v":""},{"$f":"IFERROR(INDEX($A$11:$A$500, MATCH(0, COUNTIF($B$10:B289, $A$11:$A$500), 0)),\"\")","v":""},{"$f":"IF(B290=\"\",\"\",COUNTIF('Incident Log'!$C$11:$C$500,B290))","v":""},{"$f":"IF(B290=\"\",\"\",RANK(C290,$C$11:$C$500)+COUNTIF($C$11:C290,C290)-1)","v":""},"","",""]
[{"$f":"IF('Incident Log'!C291=\"\",\"\",'Incident Log'!C291)","v":""},{"$f":"IFERROR(INDEX($A$11:$A$500, MATCH(0, COUNTIF($B$10:B290, $A$11:$A$500), 0)),\"\")","v":""},{"$f":"IF(B291=\"\",\"\",COUNTIF('Incident Log'!$C$11:$C$500,B291))","v":""},{"$f":"IF(B291=\"\",\"\",RANK(C291,$C$11:$C$500)+COUNTIF($C$11:C291,C291)-1)","v":""},"","",""]
[{"$f":"IF('Incident Log'!C292=\"\",\"\",'Incident Log'!C292)","v":""},{"$f":"IFERROR(INDEX($A$11:$A$500, MATCH(0, COUNTIF($B$10:B291, $A$11:$A$500), 0)),\"\")","v":""},{"$f":"IF(B292=\"\",\"\",COUNTIF('Incident Log'!$C$11:$C$500,B292))","v":""},{"$f":"IF(B292=\"\",\"\",RANK(C292,$C$11:$C$500)+COUNTIF($C$11:C292,C292)-1)","v":""},"","",""]
[{"$f":"IF('Incident Log'!C293=\"\",\"\",'Incident Log'!C293)","v":""},{"$f":"IFERROR(INDEX($A$11:$A$500, MATCH(0, COUNTIF($B$10:B292, $A$11:$A$500), 0)),\"\")","v":""},{"$f":"IF(B293=\"\",\"\",COUNTIF('Incident Log'!$C$11:$C$500,B293))","v":""},{"$f":"IF(B293=\"\",\"\",RANK(C293,$C$11:$C$500)+COUNTIF($C$11:C293,C293)-1)","v":""},"","",""]
[{"$f":"IF('Incident Log'!C294=\"\",\"\",'Incident Log'!C294)","v":""},{"$f":"IFERROR(INDEX($A$11:$A$500, MATCH(0, COUNTIF($B$10:B293, $A$11:$A$500), 0)),\"\")","v":""},{"$f":"IF(B294=\"\",\"\",COUNTIF('Incident Log'!$C$11:$C$500,B294))","v":""},{"$f":"IF(B294=\"\",\"\",RANK(C294,$C$11:$C$500)+COUNTIF($C$11:C294,C294)-1)","v":""},"","",""]
[{"$f":"IF('Incident Log'!C295=\"\",\"\",'Incident Log'!C295)","v":""},{"$f":"IFERROR(INDEX($A$11:$A$500, MATCH(0, COUNTIF($B$10:B294, $A$11:$A$500), 0)),\"\")","v":""},{"$f":"IF(B295=\"\",\"\",COUNTIF('Incident Log'!$C$11:$C$500,B295))","v":""},{"$f":"IF(B295=\"\",\"\",RANK(C295,$C$11:$C$500)+COUNTIF($C$11:C295,C295)-1)","v":""},"","",""]
[{"$f":"IF('Incident Log'!C296=\"\",\"\",'Incident Log'!C296)","v":""},{"$f":"IFERROR(INDEX($A$11:$A$500, MATCH(0, COUNTIF($B$10:B295, $A$11:$A$500), 0)),\"\")","v":""},{"$f":"IF(B296=\"\",\"\",COUNTIF('Incident Log'!$C$11:$C$500,B296))","v":""},{"$f":"IF(B296=\"\",\"\",RANK(C296,$C$11:$C$500)+COUNTIF($C$11:C296,C296)-1)","v":""},"","",""]
[{"$f":"IF('Incident Log'!C297=\"\",\"\",'Incident Log'!C297)","v":""},{"$f":"IFERROR(INDEX($A$11:$A$500, MATCH(0, COUNTIF($B$10:B296, $A$11:$A$500), 0)),\"\")","v":""},{"$f":"IF(B297=\"\",\"\",COUNTIF('Incident Log'!$C$11:$C$500,B297))","v":""},{"$f":"IF(B297=\"\",\"\",RANK(C297,$C$11:$C$500)+COUNTIF($C$11:C297,C297)-1)","v":""},"","",""]
[{"$f":"IF('Incident Log'!C298=\"\",\"\",'Incident Log'!C298)","v":""},{"$f":"IFERROR(INDEX($A$11:$A$500, MATCH(0, COUNTIF($B$10:B297, $A$11:$A$500), 0)),\"\")","v":""},{"$f":"IF(B298=\"\",\"\",COUNTIF('Incident Log'!$C$11:$C$500,B298))","v":""},{"$f":"IF(B298=\"\",\"\",RANK(C298,$C$11:$C$500)+COUNTIF($C$11:C298,C298)-1)","v":""},"","",""]
[{"$f":"IF('Incident Log'!C299=\"\",\"\",'Incident Log'!C299)","v":""},{"$f":"IFERROR(INDEX($A$11:$A$500, MATCH(0, COUNTIF($B$10:B298, $A$11:$A$500), 0)),\"\")","v":""},{"$f":"IF(B299=\"\",\"\",COUNTIF('Incident Log'!$C$11:$C$500,B299))","v":""},{"$f":"IF(B299=\"\",\"\",RANK(C299,$C$11:$C$500)+COUNTIF($C$11:C299,C299)-1)","v":""},"","",""]
[{"$f":"IF('Incident Log'!C300=\"\",\"\",'Incident Log'!C300)","v":""},{"$f":"IFERROR(INDEX($A$11:$A$500, MATCH(0, COUNTIF($B$10:B299, $A$11:$A$500), 0)),\"\")","v":""},{"$f":"IF(B300=\"\",\"\",COUNTIF('Incident Log'!$C$11:$C$500,B300))","v":""},{"$f":"IF(B300=\"\",\"\",RANK(C300,$C$11:$C$500)+COUNTIF($C$11:C300,C300)-1)","v":""},"","",""]
[{"$f":"IF('Incident Log'!C301=\"\",\"\",'Incident Log'!C301)","v":""},{"$f":"IFERROR(INDEX($A$11:$A$500, MATCH(0, COUNTIF($B$10:B300, $A$11:$A$500), 0)),\"\")","v":""},{"$f":"IF(B301=\"\",\"\",COUNTIF('Incident Log'!$C$11:$C$500,B301))","v":""},{"$f":"IF(B301=\"\",\"\",RANK(C301,$C$11:$C$500)+COUNTIF($C$11:C301,C301)-1)","v":""},"","",""]
[{"$f":"IF('Incident Log'!C302=\"\",\"\",'Incident Log'!C302)","v":""},{"$f":"IFERROR(INDEX($A$11:$A$500, MATCH(0, COUNTIF($B$10:B301, $A$11:$A$500), 0)),\"\")","v":""},{"$f":"IF(B302=\"\",\"\",COUNTIF('Incident Log'!$C$11:$C$500,B302))","v":""},{"$f":"IF(B302=\"\",\"\",RANK(C302,$C$11:$C$500)+COUNTIF($C$11:C302,C302)-1)","v":""},"","",""]
[{"$f":"IF('Incident Log'!C303=\"\",\"\",'Incident Log'!C303)","v":""},{"$f":"IFERROR(INDEX($A$11:$A$500, MATCH(0, COUNTIF($B$10:B302, $A$11:$A$500), 0)),\"\")","v":""},{"$f":"IF(B303=\"\",\"\",COUNTIF('Incident Log'!$C$11:$C$500,B303))","v":""},{"$f":"IF(B303=\"\",\"\",RANK(C303,$C$11:$C$500)+COUNTIF($C$11:C303,C303)-1)","v":""},"","",""]
[{"$f":"IF('Incident Log'!C304=\"\",\"\",'Incident Log'!C304)","v":""},{"$f":"IFERROR(INDEX($A$11:$A$500, MATCH(0, COUNTIF($B$10:B303, $A$11:$A$500), 0)),\"\")","v":""},{"$f":"IF(B304=\"\",\"\",COUNTIF('Incident Log'!$C$11:$C$500,B304))","v":""},{"$f":"IF(B304=\"\",\"\",RANK(C304,$C$11:$C$500)+COUNTIF($C$11:C304,C304)-1)","v":""},"","",""]
[{"$f":"IF('Incident Log'!C305=\"\",\"\",'Incident Log'!C305)","v":""},{"$f":"IFERROR(INDEX($A$11:$A$500, MATCH(0, COUNTIF($B$10:B304, $A$11:$A$500), 0)),\"\")","v":""},{"$f":"IF(B305=\"\",\"\",COUNTIF('Incident Log'!$C$11:$C$500,B305))","v":""},{"$f":"IF(B305=\"\",\"\",RANK(C305,$C$11:$C$500)+COUNTIF($C$11:C305,C305)-1)","v":""},"","",""]
[{"$f":"IF('Incident Log'!C306=\"\",\"\",'Incident Log'!C306)","v":""},{"$f":"IFERROR(INDEX($A$11:$A$500, MATCH(0, COUNTIF($B$10:B305, $A$11:$A$500), 0)),\"\")","v":""},{"$f":"IF(B306=\"\",\"\",COUNTIF('Incident Log'!$C$11:$C$500,B306))","v":""},{"$f":"IF(B306=\"\",\"\",RANK(C306,$C$11:$C$500)+COUNTIF($C$11:C306,C306)-1)","v":""},"","",""]
[{"$f":"IF('Incident Log'!C307=\"\",\"\",'Incident Log'!C307)","v":""},{"$f":"IFERROR(INDEX($A$11:$A$500, MATCH(0, COUNTIF($B$10:B306, $A$11:$A$500), 0)),\"\")","v":""},{"$f":"IF(B307=\"\",\"\",COUNTIF('Incident Log'!$C$11:$C$500,B307))","v":""},{"$f":"IF(B307=\"\",\"\",RANK(C307,$C$11:$C$500)+COUNTIF($C$11:C307,C307)-1)","v":""},"","",""]
[{"$f":"IF('Incident Log'!C308=\"\",\"\",'Incident Log'!C308)","v":""},{"$f":"IFERROR(INDEX($A$11:$A$500, MATCH(0, COUNTIF($B$10:B307, $A$11:$A$500), 0)),\"\")","v":""},{"$f":"IF(B308=\"\",\"\",COUNTIF('Incident Log'!$C$11:$C$500,B308))","v":""},{"$f":"IF(B308=\"\",\"\",RANK(C308,$C$11:$C$500)+COUNTIF($C$11:C308,C308)-1)","v":""},"","",""]
[{"$f":"IF('Incident Log'!C309=\"\",\"\",'Incident Log'!C309)","v":""},{"$f":"IFERROR(INDEX($A$11:$A$500, MATCH(0, COUNTIF($B$10:B308, $A$11:$A$500), 0)),\"\")","v":""},{"$f":"IF(B309=\"\",\"\",COUNTIF('Incident Log'!$C$11:$C$500,B309))","v":""},{"$f":"IF(B309=\"\",\"\",RANK(C309,$C$11:$C$500)+COUNTIF($C$11:C309,C309)-1)","v":""},"","",""]
[{"$f":"IF('Incident Log'!C310=\"\",\"\",'Incident Log'!C310)","v":""},{"$f":"IFERROR(INDEX($A$11:$A$500, MATCH(0, COUNTIF($B$10:B309, $A$11:$A$500), 0)),\"\")","v":""},{"$f":"IF(B310=\"\",\"\",COUNTIF('Incident Log'!$C$11:$C$500,B310))","v":""},{"$f":"IF(B310=\"\",\"\",RANK(C310,$C$11:$C$500)+COUNTIF($C$11:C310,C310)-1)","v":""},"","",""]
[{"$f":"IF('Incident Log'!C311=\"\",\"\",'Incident Log'!C311)","v":""},{"$f":"IFERROR(INDEX($A$11:$A$500, MATCH(0, COUNTIF($B$10:B310, $A$11:$A$500), 0)),\"\")","v":""},{"$f":"IF(B311=\"\",\"\",COUNTIF('Incident Log'!$C$11:$C$500,B311))","v":""},{"$f":"IF(B311=\"\",\"\",RANK(C311,$C$11:$C$500)+COUNTIF($C$11:C311,C311)-1)","v":""},"","",""]
[{"$f":"IF('Incident Log'!C312=\"\",\"\",'Incident Log'!C312)","v":""},{"$f":"IFERROR(INDEX($A$11:$A$500, MATCH(0, COUNTIF($B$10:B311, $A$11:$A$500), 0)),\"\")","v":""},{"$f":"IF(B312=\"\",\"\",COUNTIF('Incident Log'!$C$11:$C$500,B312))","v":""},{"$f":"IF(B312=\"\",\"\",RANK(C312,$C$11:$C$500)+COUNTIF($C$11:C312,C312)-1)","v":""},"","",""]
[{"$f":"IF('Incident Log'!C313=\"\",\"\",'Incident Log'!C313)","v":""},{"$f":"IFERROR(INDEX($A$11:$A$500, MATCH(0, COUNTIF($B$10:B312, $A$11:$A$500), 0)),\"\")","v":""},{"$f":"IF(B313=\"\",\"\",COUNTIF('Incident Log'!$C$11:$C$500,B313))","v":""},{"$f":"IF(B313=\"\",\"\",RANK(C313,$C$11:$C$500)+COUNTIF($C$11:C313,C313)-1)","v":""},"","",""]
[{"$f":"IF('Incident Log'!C314=\"\",\"\",'Incident Log'!C314)","v":""},{"$f":"IFERROR(INDEX($A$11:$A$500, MATCH(0, COUNTIF($B$10:B313, $A$11:$A$500), 0)),\"\")","v":""},{"$f":"IF(B314=\"\",\"\",COUNTIF('Incident Log'!$C$11:$C$500,B314))","v":""},{"$f":"IF(B314=\"\",\"\",RANK(C314,$C$11:$C$500)+COUNTIF($C$11:C314,C314)-1)","v":""},"","",""]
[{"$f":"IF('Incident Log'!C315=\"\",\"\",'Incident Log'!C315)","v":""},{"$f":"IFERROR(INDEX($A$11:$A$500, MATCH(0, COUNTIF($B$10:B314, $A$11:$A$500), 0)),\"\")","v":""},{"$f":"IF(B315=\"\",\"\",COUNTIF('Incident Log'!$C$11:$C$500,B315))","v":""},{"$f":"IF(B315=\"\",\"\",RANK(C315,$C$11:$C$500)+COUNTIF($C$11:C315,C315)-1)","v":""},"","",""]
[{"$f":"IF('Incident Log'!C316=\"\",\"\",'Incident Log'!C316)","v":""},{"$f":"IFERROR(INDEX($A$11:$A$500, MATCH(0, COUNTIF($B$10:B315, $A$11:$A$500), 0)),\"\")","v":""},{"$f":"IF(B316=\"\",\"\",COUNTIF('Incident Log'!$C$11:$C$500,B316))","v":""},{"$f":"IF(B316=\"\",\"\",RANK(C316,$C$11:$C$500)+COUNTIF($C$11:C316,C316)-1)","v":""},"","",""]
[{"$f":"IF('Incident Log'!C317=\"\",\"\",'Incident Log'!C317)","v":""},{"$f":"IFERROR(INDEX($A$11:$A$500, MATCH(0, COUNTIF($B$10:B316, $A$11:$A$500), 0)),\"\")","v":""},{"$f":"IF(B317=\"\",\"\",COUNTIF('Incident Log'!$C$11:$C$500,B317))","v":""},{"$f":"IF(B317=\"\",\"\",RANK(C317,$C$11:$C$500)+COUNTIF($C$11:C317,C317)-1)","v":""},"","",""]
[{"$f":"IF('Incident Log'!C318=\"\",\"\",'Incident Log'!C318)","v":""},{"$f":"IFERROR(INDEX($A$11:$A$500, MATCH(0, COUNTIF($B$10:B317, $A$11:$A$500), 0)),\"\")","v":""},{"$f":"IF(B318=\"\",\"\",COUNTIF('Incident Log'!$C$11:$C$500,B318))","v":""},{"$f":"IF(B318=\"\",\"\",RANK(C318,$C$11:$C$500)+COUNTIF($C$11:C318,C318)-1)","v":""},"","",""]
[{"$f":"IF('Incident Log'!C319=\"\",\"\",'Incident Log'!C319)","v":""},{"$f":"IFERROR(INDEX($A$11:$A$500, MATCH(0, COUNTIF($B$10:B318, $A$11:$A$500), 0)),\"\")","v":""},{"$f":"IF(B319=\"\",\"\",COUNTIF('Incident Log'!$C$11:$C$500,B319))","v":""},{"$f":"IF(B319=\"\",\"\",RANK(C319,$C$11:$C$500)+COUNTIF($C$11:C319,C319)-1)","v":""},"","",""]
[{"$f":"IF('Incident Log'!C320=\"\",\"\",'Incident Log'!C320)","v":""},{"$f":"IFERROR(INDEX($A$11:$A$500, MATCH(0, COUNTIF($B$10:B319, $A$11:$A$500), 0)),\"\")","v":""},{"$f":"IF(B320=\"\",\"\",COUNTIF('Incident Log'!$C$11:$C$500,B320))","v":""},{"$f":"IF(B320=\"\",\"\",RANK(C320,$C$11:$C$500)+COUNTIF($C$11:C320,C320)-1)","v":""},"","",""]
[{"$f":"IF('Incident Log'!C321=\"\",\"\",'Incident Log'!C321)","v":""},{"$f":"IFERROR(INDEX($A$11:$A$500, MATCH(0, COUNTIF($B$10:B320, $A$11:$A$500), 0)),\"\")","v":""},{"$f":"IF(B321=\"\",\"\",COUNTIF('Incident Log'!$C$11:$C$500,B321))","v":""},{"$f":"IF(B321=\"\",\"\",RANK(C321,$C$11:$C$500)+COUNTIF($C$11:C321,C321)-1)","v":""},"","",""]
[{"$f":"IF('Incident Log'!C322=\"\",\"\",'Incident Log'!C322)","v":""},{"$f":"IFERROR(INDEX($A$11:$A$500, MATCH(0, COUNTIF($B$10:B321, $A$11:$A$500), 0)),\"\")","v":""},{"$f":"IF(B322=\"\",\"\",COUNTIF('Incident Log'!$C$11:$C$500,B322))","v":""},{"$f":"IF(B322=\"\",\"\",RANK(C322,$C$11:$C$500)+COUNTIF($C$11:C322,C322)-1)","v":""},"","",""]
[{"$f":"IF('Incident Log'!C323=\"\",\"\",'Incident Log'!C323)","v":""},{"$f":"IFERROR(INDEX($A$11:$A$500, MATCH(0, COUNTIF($B$10:B322, $A$11:$A$500), 0)),\"\")","v":""},{"$f":"IF(B323=\"\",\"\",COUNTIF('Incident Log'!$C$11:$C$500,B323))","v":""},{"$f":"IF(B323=\"\",\"\",RANK(C323,$C$11:$C$500)+COUNTIF($C$11:C323,C323)-1)","v":""},"","",""]
[{"$f":"IF('Incident Log'!C324=\"\",\"\",'Incident Log'!C324)","v":""},{"$f":"IFERROR(INDEX($A$11:$A$500, MATCH(0, COUNTIF($B$10:B323, $A$11:$A$500), 0)),\"\")","v":""},{"$f":"IF(B324=\"\",\"\",COUNTIF('Incident Log'!$C$11:$C$500,B324))","v":""},{"$f":"IF(B324=\"\",\"\",RANK(C324,$C$11:$C$500)+COUNTIF($C$11:C324,C324)-1)","v":""},"","",""]
[{"$f":"IF('Incident Log'!C325=\"\",\"\",'Incident Log'!C325)","v":""},{"$f":"IFERROR(INDEX($A$11:$A$500, MATCH(0, COUNTIF($B$10:B324, $A$11:$A$500), 0)),\"\")","v":""},{"$f":"IF(B325=\"\",\"\",COUNTIF('Incident Log'!$C$11:$C$500,B325))","v":""},{"$f":"IF(B325=\"\",\"\",RANK(C325,$C$11:$C$500)+COUNTIF($C$11:C325,C325)-1)","v":""},"","",""]
[{"$f":"IF('Incident Log'!C326=\"\",\"\",'Incident Log'!C326)","v":""},{"$f":"IFERROR(INDEX($A$11:$A$500, MATCH(0, COUNTIF($B$10:B325, $A$11:$A$500), 0)),\"\")","v":""},{"$f":"IF(B326=\"\",\"\",COUNTIF('Incident Log'!$C$11:$C$500,B326))","v":""},{"$f":"IF(B326=\"\",\"\",RANK(C326,$C$11:$C$500)+COUNTIF($C$11:C326,C326)-1)","v":""},"","",""]
[{"$f":"IF('Incident Log'!C327=\"\",\"\",'Incident Log'!C327)","v":""},{"$f":"IFERROR(INDEX($A$11:$A$500, MATCH(0, COUNTIF($B$10:B326, $A$11:$A$500), 0)),\"\")","v":""},{"$f":"IF(B327=\"\",\"\",COUNTIF('Incident Log'!$C$11:$C$500,B327))","v":""},{"$f":"IF(B327=\"\",\"\",RANK(C327,$C$11:$C$500)+COUNTIF($C$11:C327,C327)-1)","v":""},"","",""]
[{"$f":"IF('Incident Log'!C328=\"\",\"\",'Incident Log'!C328)","v":""},{"$f":"IFERROR(INDEX($A$11:$A$500, MATCH(0, COUNTIF($B$10:B327, $A$11:$A$500), 0)),\"\")","v":""},{"$f":"IF(B328=\"\",\"\",COUNTIF('Incident Log'!$C$11:$C$500,B328))","v":""},{"$f":"IF(B328=\"\",\"\",RANK(C328,$C$11:$C$500)+COUNTIF($C$11:C328,C328)-1)","v":""},"","",""]
[{"$f":"IF('Incident Log'!C329=\"\",\"\",'Incident Log'!C329)","v":""},{"$f":"IFERROR(INDEX($A$11:$A$500, MATCH(0, COUNTIF($B$10:B328, $A$11:$A$500), 0)),\"\")","v":""},{"$f":"IF(B329=\"\",\"\",COUNTIF('Incident Log'!$C$11:$C$500,B329))","v":""},{"$f":"IF(B329=\"\",\"\",RANK(C329,$C$11:$C$500)+COUNTIF($C$11:C329,C329)-1)","v":""},"","",""]
[{"$f":"IF('Incident Log'!C330=\"\",\"\",'Incident Log'!C330)","v":""},{"$f":"IFERROR(INDEX($A$11:$A$500, MATCH(0, COUNTIF($B$10:B329, $A$11:$A$500), 0)),\"\")","v":""},{"$f":"IF(B330=\"\",\"\",COUNTIF('Incident Log'!$C$11:$C$500,B330))","v":""},{"$f":"IF(B330=\"\",\"\",RANK(C330,$C$11:$C$500)+COUNTIF($C$11:C330,C330)-1)","v":""},"","",""]
[{"$f":"IF('Incident Log'!C331=\"\",\"\",'Incident Log'!C331)","v":""},{"$f":"IFERROR(INDEX($A$11:$A$500, MATCH(0, COUNTIF($B$10:B330, $A$11:$A$500), 0)),\"\")","v":""},{"$f":"IF(B331=\"\",\"\",COUNTIF('Incident Log'!$C$11:$C$500,B331))","v":""},{"$f":"IF(B331=\"\",\"\",RANK(C331,$C$11:$C$500)+COUNTIF($C$11:C331,C331)-1)","v":""},"","",""]
[{"$f":"IF('Incident Log'!C332=\"\",\"\",'Incident Log'!C332)","v":""},{"$f":"IFERROR(INDEX($A$11:$A$500, MATCH(0, COUNTIF($B$10:B331, $A$11:$A$500), 0)),\"\")","v":""},{"$f":"IF(B332=\"\",\"\",COUNTIF('Incident Log'!$C$11:$C$500,B332))","v":""},{"$f":"IF(B332=\"\",\"\",RANK(C332,$C$11:$C$500)+COUNTIF($C$11:C332,C332)-1)","v":""},"",{"$f":"IF(B332=\"\",\"\",INDEX($B$11:$B$500,MATCH(E332,$D$11:$D$500,0)))","v":""},{"$f":"IF(B332=\"\",\"\",VLOOKUP(F332,$B$11:$C$500,2,FALSE))","v":""}]
[{"$f":"IF('Incident Log'!C333=\"\",\"\",'Incident Log'!C333)","v":""},{"$f":"IFERROR(INDEX($A$11:$A$500, MATCH(0, COUNTIF($B$10:B332, $A$11:$A$500), 0)),\"\")","v":""},{"$f":"IF(B333=\"\",\"\",COUNTIF('Incident Log'!$C$11:$C$500,B333))","v":""},{"$f":"IF(B333=\"\",\"\",RANK(C333,$C$11:$C$500)+COUNTIF($C$11:C333,C333)-1)","v":""},"","",""]
[{"$f":"IF('Incident Log'!C334=\"\",\"\",'Incident Log'!C334)","v":""},{"$f":"IFERROR(INDEX($A$11:$A$500, MATCH(0, COUNTIF($B$10:B333, $A$11:$A$500), 0)),\"\")","v":""},{"$f":"IF(B334=\"\",\"\",COUNTIF('Incident Log'!$C$11:$C$500,B334))","v":""},{"$f":"IF(B334=\"\",\"\",RANK(C334,$C$11:$C$500)+COUNTIF($C$11:C334,C334)-1)","v":""},{"$f":"IF(B334=\"\",\"\",1+E333)","v":""},"",""]
[{"$f":"IF('Incident Log'!C335=\"\",\"\",'Incident Log'!C335)","v":""},{"$f":"IFERROR(INDEX($A$11:$A$500, MATCH(0, COUNTIF($B$10:B334, $A$11:$A$500), 0)),\"\")","v":""},{"$f":"IF(B335=\"\",\"\",COUNTIF('Incident Log'!$C$11:$C$500,B335))","v":""},{"$f":"IF(B335=\"\",\"\",RANK(C335,$C$11:$C$500)+COUNTIF($C$11:C335,C335)-1)","v":""},"","",""]
[{"$f":"IF('Incident Log'!C336=\"\",\"\",'Incident Log'!C336)","v":""},{"$f":"IFERROR(INDEX($A$11:$A$500, MATCH(0, COUNTIF($B$10:B335, $A$11:$A$500), 0)),\"\")","v":""},{"$f":"IF(B336=\"\",\"\",COUNTIF('Incident Log'!$C$11:$C$500,B336))","v":""},{"$f":"IF(B336=\"\",\"\",RANK(C336,$C$11:$C$500)+COUNTIF($C$11:C336,C336)-1)","v":""},"","",""]
[{"$f":"IF('Incident Log'!C337=\"\",\"\",'Incident Log'!C337)","v":""},{"$f":"IFERROR(INDEX($A$11:$A$500, MATCH(0, COUNTIF($B$10:B336, $A$11:$A$500), 0)),\"\")","v":""},{"$f":"IF(B337=\"\",\"\",COUNTIF('Incident Log'!$C$11:$C$500,B337))","v":""},{"$f":"IF(B337=\"\",\"\",RANK(C337,$C$11:$C$500)+COUNTIF($C$11:C337,C337)-1)","v":""},"","",""]
[{"$f":"IF('Incident Log'!C338=\"\",\"\",'Incident Log'!C338)","v":""},{"$f":"IFERROR(INDEX($A$11:$A$500, MATCH(0, COUNTIF($B$10:B337, $A$11:$A$500), 0)),\"\")","v":""},{"$f":"IF(B338=\"\",\"\",COUNTIF('Incident Log'!$C$11:$C$500,B338))","v":""},{"$f":"IF(B338=\"\",\"\",RANK(C338,$C$11:$C$500)+COUNTIF($C$11:C338,C338)-1)","v":""},"","",""]
[{"$f":"IF('Incident Log'!C339=\"\",\"\",'Incident Log'!C339)","v":""},{"$f":"IFERROR(INDEX($A$11:$A$500, MATCH(0, COUNTIF($B$10:B338, $A$11:$A$500), 0)),\"\")","v":""},{"$f":"IF(B339=\"\",\"\",COUNTIF('Incident Log'!$C$11:$C$500,B339))","v":""},{"$f":"IF(B339=\"\",\"\",RANK(C339,$C$11:$C$500)+COUNTIF($C$11:C339,C339)-1)","v":""},"","",""]
[{"$f":"IF('Incident Log'!C340=\"\",\"\",'Incident Log'!C340)","v":""},{"$f":"IFERROR(INDEX($A$11:$A$500, MATCH(0, COUNTIF($B$10:B339, $A$11:$A$500), 0)),\"\")","v":""},{"$f":"IF(B340=\"\",\"\",COUNTIF('Incident Log'!$C$11:$C$500,B340))","v":""},{"$f":"IF(B340=\"\",\"\",RANK(C340,$C$11:$C$500)+COUNTIF($C$11:C340,C340)-1)","v":""},"","",""]
[{"$f":"IF('Incident Log'!C341=\"\",\"\",'Incident Log'!C341)","v":""},{"$f":"IFERROR(INDEX($A$11:$A$500, MATCH(0, COUNTIF($B$10:B340, $A$11:$A$500), 0)),\"\")","v":""},{"$f":"IF(B341=\"\",\"\",COUNTIF('Incident Log'!$C$11:$C$500,B341))","v":""},{"$f":"IF(B341=\"\",\"\",RANK(C341,$C$11:$C$500)+COUNTIF($C$11:C341,C341)-1)","v":""},"","",""]
[{"$f":"IF('Incident Log'!C342=\"\",\"\",'Incident Log'!C342)","v":""},{"$f":"IFERROR(INDEX($A$11:$A$500, MATCH(0, COUNTIF($B$10:B341, $A$11:$A$500), 0)),\"\")","v":""},{"$f":"IF(B342=\"\",\"\",COUNTIF('Incident Log'!$C$11:$C$500,B342))","v":""},{"$f":"IF(B342=\"\",\"\",RANK(C342,$C$11:$C$500)+COUNTIF($C$11:C342,C342)-1)","v":""},"","",""]
[{"$f":"IF('Incident Log'!C343=\"\",\"\",'Incident Log'!C343)","v":""},{"$f":"IFERROR(INDEX($A$11:$A$500, MATCH(0, COUNTIF($B$10:B342, $A$11:$A$500), 0)),\"\")","v":""},{"$f":"IF(B343=\"\",\"\",COUNTIF('Incident Log'!$C$11:$C$500,B343))","v":""},{"$f":"IF(B343=\"\",\"\",RANK(C343,$C$11:$C$500)+COUNTIF($C$11:C343,C343)-1)","v":""},"","",""]
[{"$f":"IF('Incident Log'!C344=\"\",\"\",'Incident Log'!C344)","v":""},{"$f":"IFERROR(INDEX($A$11:$A$500, MATCH(0, COUNTIF($B$10:B343, $A$11:$A$500), 0)),\"\")","v":""},{"$f":"IF(B344=\"\",\"\",COUNTIF('Incident Log'!$C$11:$C$500,B344))","v":""},{"$f":"IF(B344=\"\",\"\",RANK(C344,$C$11:$C$500)+COUNTIF($C$11:C344,C344)-1)","v":""},"","",""]
[{"$f":"IF('Incident Log'!C345=\"\",\"\",'Incident Log'!C345)","v":""},{"$f":"IFERROR(INDEX($A$11:$A$500, MATCH(0, COUNTIF($B$10:B344, $A$11:$A$500), 0)),\"\")","v":""},{"$f":"IF(B345=\"\",\"\",COUNTIF('Incident Log'!$C$11:$C$500,B345))","v":""},{"$f":"IF(B345=\"\",\"\",RANK(C345,$C$11:$C$500)+COUNTIF($C$11:C345,C345)-1)","v":""},"","",""]
[{"$f":"IF('Incident Log'!C346=\"\",\"\",'Incident Log'!C346)","v":""},{"$f":"IFERROR(INDEX($A$11:$A$500, MATCH(0, COUNTIF($B$10:B345, $A$11:$A$500), 0)),\"\")","v":""},{"$f":"IF(B346=\"\",\"\",COUNTIF('Incident Log'!$C$11:$C$500,B346))","v":""},{"$f":"IF(B346=\"\",\"\",RANK(C346,$C$11:$C$500)+COUNTIF($C$11:C346,C346)-1)","v":""},"","",""]
[{"$f":"IF('Incident Log'!C347=\"\",\"\",'Incident Log'!C347)","v":""},{"$f":"IFERROR(INDEX($A$11:$A$500, MATCH(0, COUNTIF($B$10:B346, $A$11:$A$500), 0)),\"\")","v":""},{"$f":"IF(B347=\"\",\"\",COUNTIF('Incident Log'!$C$11:$C$500,B347))","v":""},{"$f":"IF(B347=\"\",\"\",RANK(C347,$C$11:$C$500)+COUNTIF($C$11:C347,C347)-1)","v":""},"","",""]
[{"$f":"IF('Incident Log'!C348=\"\",\"\",'Incident Log'!C348)","v":""},{"$f":"IFERROR(INDEX($A$11:$A$500, MATCH(0, COUNTIF($B$10:B347, $A$11:$A$500), 0)),\"\")","v":""},{"$f":"IF(B348=\"\",\"\",COUNTIF('Incident Log'!$C$11:$C$500,B348))","v":""},{"$f":"IF(B348=\"\",\"\",RANK(C348,$C$11:$C$500)+COUNTIF($C$11:C348,C348)-1)","v":""},"","",""]
[{"$f":"IF('Incident Log'!C349=\"\",\"\",'Incident Log'!C349)","v":""},{"$f":"IFERROR(INDEX($A$11:$A$500, MATCH(0, COUNTIF($B$10:B348, $A$11:$A$500), 0)),\"\")","v":""},{"$f":"IF(B349=\"\",\"\",COUNTIF('Incident Log'!$C$11:$C$500,B349))","v":""},{"$f":"IF(B349=\"\",\"\",RANK(C349,$C$11:$C$500)+COUNTIF($C$11:C349,C349)-1)","v":""},"","",""]
[{"$f":"IF('Incident Log'!C350=\"\",\"\",'Incident Log'!C350)","v":""},{"$f":"IFERROR(INDEX($A$11:$A$500, MATCH(0, COUNTIF($B$10:B349, $A$11:$A$500), 0)),\"\")","v":""},{"$f":"IF(B350=\"\",\"\",COUNTIF('Incident Log'!$C$11:$C$500,B350))","v":""},{"$f":"IF(B350=\"\",\"\",RANK(C350,$C$11:$C$500)+COUNTIF($C$11:C350,C350)-1)","v":""},"","",""]
[{"$f":"IF('Incident Log'!C351=\"\",\"\",'Incident Log'!C351)","v":""},{"$f":"IFERROR(INDEX($A$11:$A$500, MATCH(0, COUNTIF($B$10:B350, $A$11:$A$500), 0)),\"\")","v":""},{"$f":"IF(B351=\"\",\"\",COUNTIF('Incident Log'!$C$11:$C$500,B351))","v":""},{"$f":"IF(B351=\"\",\"\",RANK(C351,$C$11:$C$500)+COUNTIF($C$11:C351,C351)-1)","v":""},"","",""]
[{"$f":"IF('Incident Log'!C352=\"\",\"\",'Incident Log'!C352)","v":""},{"$f":"IFERROR(INDEX($A$11:$A$500, MATCH(0, COUNTIF($B$10:B351, $A$11:$A$500), 0)),\"\")","v":""},{"$f":"IF(B352=\"\",\"\",COUNTIF('Incident Log'!$C$11:$C$500,B352))","v":""},{"$f":"IF(B352=\"\",\"\",RANK(C352,$C$11:$C$500)+COUNTIF($C$11:C352,C352)-1)","v":""},"","",""]
[{"$f":"IF('Incident Log'!C353=\"\",\"\",'Incident Log'!C353)","v":""},{"$f":"IFERROR(INDEX($A$11:$A$500, MATCH(0, COUNTIF($B$10:B352, $A$11:$A$500), 0)),\"\")","v":""},{"$f":"IF(B353=\"\",\"\",COUNTIF('Incident Log'!$C$11:$C$500,B353))","v":""},{"$f":"IF(B353=\"\",\"\",RANK(C353,$C$11:$C$500)+COUNTIF($C$11:C353,C353)-1)","v":""},"","",""]
[{"$f":"IF('Incident Log'!C354=\"\",\"\",'Incident Log'!C354)","v":""},{"$f":"IFERROR(INDEX($A$11:$A$500, MATCH(0, COUNTIF($B$10:B353, $A$11:$A$500), 0)),\"\")","v":""},{"$f":"IF(B354=\"\",\"\",COUNTIF('Incident Log'!$C$11:$C$500,B354))","v":""},{"$f":"IF(B354=\"\",\"\",RANK(C354,$C$11:$C$500)+COUNTIF($C$11:C354,C354)-1)","v":""},"","",""]
[{"$f":"IF('Incident Log'!C355=\"\",\"\",'Incident Log'!C355)","v":""},{"$f":"IFERROR(INDEX($A$11:$A$500, MATCH(0, COUNTIF($B$10:B354, $A$11:$A$500), 0)),\"\")","v":""},{"$f":"IF(B355=\"\",\"\",COUNTIF('Incident Log'!$C$11:$C$500,B355))","v":""},{"$f":"IF(B355=\"\",\"\",RANK(C355,$C$11:$C$500)+COUNTIF($C$11:C355,C355)-1)","v":""},"","",""]
[{"$f":"IF('Incident Log'!C356=\"\",\"\",'Incident Log'!C356)","v":""},{"$f":"IFERROR(INDEX($A$11:$A$500, MATCH(0, COUNTIF($B$10:B355, $A$11:$A$500), 0)),\"\")","v":""},{"$f":"IF(B356=\"\",\"\",COUNTIF('Incident Log'!$C$11:$C$500,B356))","v":""},{"$f":"IF(B356=\"\",\"\",RANK(C356,$C$11:$C$500)+COUNTIF($C$11:C356,C356)-1)","v":""},"","",""]
[{"$f":"IF('Incident Log'!C357=\"\",\"\",'Incident Log'!C357)","v":""},{"$f":"IFERROR(INDEX($A$11:$A$500, MATCH(0, COUNTIF($B$10:B356, $A$11:$A$500), 0)),\"\")","v":""},{"$f":"IF(B357=\"\",\"\",COUNTIF('Incident Log'!$C$11:$C$500,B357))","v":""},{"$f":"IF(B357=\"\",\"\",RANK(C357,$C$11:$C$500)+COUNTIF($C$11:C357,C357)-1)","v":""},"","",""]
[{"$f":"IF('Incident Log'!C358=\"\",\"\",'Incident Log'!C358)","v":""},{"$f":"IFERROR(INDEX($A$11:$A$500, MATCH(0, COUNTIF($B$10:B357, $A$11:$A$500), 0)),\"\")","v":""},{"$f":"IF(B358=\"\",\"\",COUNTIF('Incident Log'!$C$11:$C$500,B358))","v":""},{"$f":"IF(B358=\"\",\"\",RANK(C358,$C$11:$C$500)+COUNTIF($C$11:C358,C358)-1)","v":""},"","",""]
[{"$f":"IF('Incident Log'!C359=\"\",\"\",'Incident Log'!C359)","v":""},{"$f":"IFERROR(INDEX($A$11:$A$500, MATCH(0, COUNTIF($B$10:B358, $A$11:$A$500), 0)),\"\")","v":""},{"$f":"IF(B359=\"\",\"\",COUNTIF('Incident Log'!$C$11:$C$500,B359))","v":""},{"$f":"IF(B359=\"\",\"\",RANK(C359,$C$11:$C$500)+COUNTIF($C$11:C359,C359)-1)","v":""},"","",""]
[{"$f":"IF('Incident Log'!C360=\"\",\"\",'Incident Log'!C360)","v":""},{"$f":"IFERROR(INDEX($A$11:$A$500, MATCH(0, COUNTIF($B$10:B359, $A$11:$A$500), 0)),\"\")","v":""},{"$f":"IF(B360=\"\",\"\",COUNTIF('Incident Log'!$C$11:$C$500,B360))","v":""},{"$f":"IF(B360=\"\",\"\",RANK(C360,$C$11:$C$500)+COUNTIF($C$11:C360,C360)-1)","v":""},"","",""]
[{"$f":"IF('Incident Log'!C361=\"\",\"\",'Incident Log'!C361)","v":""},{"$f":"IFERROR(INDEX($A$11:$A$500, MATCH(0, COUNTIF($B$10:B360, $A$11:$A$500), 0)),\"\")","v":""},{"$f":"IF(B361=\"\",\"\",COUNTIF('Incident Log'!$C$11:$C$500,B361))","v":""},{"$f":"IF(B361=\"\",\"\",RANK(C361,$C$11:$C$500)+COUNTIF($C$11:C361,C361)-1)","v":""},"","",""]
[{"$f":"IF('Incident Log'!C362=\"\",\"\",'Incident Log'!C362)","v":""},{"$f":"IFERROR(INDEX($A$11:$A$500, MATCH(0, COUNTIF($B$10:B361, $A$11:$A$500), 0)),\"\")","v":""},{"$f":"IF(B362=\"\",\"\",COUNTIF('Incident Log'!$C$11:$C$500,B362))","v":""},{"$f":"IF(B362=\"\",\"\",RANK(C362,$C$11:$C$500)+COUNTIF($C$11:C362,C362)-1)","v":""},"","",""]
[{"$f":"IF('Incident Log'!C363=\"\",\"\",'Incident Log'!C363)","v":""},{"$f":"IFERROR(INDEX($A$11:$A$500, MATCH(0, COUNTIF($B$10:B362, $A$11:$A$500), 0)),\"\")","v":""},{"$f":"IF(B363=\"\",\"\",COUNTIF('Incident Log'!$C$11:$C$500,B363))","v":""},{"$f":"IF(B363=\"\",\"\",RANK(C363,$C$11:$C$500)+COUNTIF($C$11:C363,C363)-1)","v":""},"","",""]
[{"$f":"IF('Incident Log'!C364=\"\",\"\",'Incident Log'!C364)","v":""},{"$f":"IFERROR(INDEX($A$11:$A$500, MATCH(0, COUNTIF($B$10:B363, $A$11:$A$500), 0)),\"\")","v":""},{"$f":"IF(B364=\"\",\"\",COUNTIF('Incident Log'!$C$11:$C$500,B364))","v":""},{"$f":"IF(B364=\"\",\"\",RANK(C364,$C$11:$C$500)+COUNTIF($C$11:C364,C364)-1)","v":""},"","",""]
[{"$f":"IF('Incident Log'!C365=\"\",\"\",'Incident Log'!C365)","v":""},{"$f":"IFERROR(INDEX($A$11:$A$500, MATCH(0, COUNTIF($B$10:B364, $A$11:$A$500), 0)),\"\")","v":""},{"$f":"IF(B365=\"\",\"\",COUNTIF('Incident Log'!$C$11:$C$500,B365))","v":""},{"$f":"IF(B365=\"\",\"\",RANK(C365,$C$11:$C$500)+COUNTIF($C$11:C365,C365)-1)","v":""},"","",""]
[{"$f":"IF('Incident Log'!C366=\"\",\"\",'Incident Log'!C366)","v":""},{"$f":"IFERROR(INDEX($A$11:$A$500, MATCH(0, COUNTIF($B$10:B365, $A$11:$A$500), 0)),\"\")","v":""},{"$f":"IF(B366=\"\",\"\",COUNTIF('Incident Log'!$C$11:$C$500,B366))","v":""},{"$f":"IF(B366=\"\",\"\",RANK(C366,$C$11:$C$500)+COUNTIF($C$11:C366,C366)-1)","v":""},"","",""]
[{"$f":"IF('Incident Log'!C367=\"\",\"\",'Incident Log'!C367)","v":""},{"$f":"IFERROR(INDEX($A$11:$A$500, MATCH(0, COUNTIF($B$10:B366, $A$11:$A$500), 0)),\"\")","v":""},{"$f":"IF(B367=\"\",\"\",COUNTIF('Incident Log'!$C$11:$C$500,B367))","v":""},{"$f":"IF(B367=\"\",\"\",RANK(C367,$C$11:$C$500)+COUNTIF($C$11:C367,C367)-1)","v":""},"","",""]
[{"$f":"IF('Incident Log'!C368=\"\",\"\",'Incident Log'!C368)","v":""},{"$f":"IFERROR(INDEX($A$11:$A$500, MATCH(0, COUNTIF($B$10:B367, $A$11:$A$500), 0)),\"\")","v":""},{"$f":"IF(B368=\"\",\"\",COUNTIF('Incident Log'!$C$11:$C$500,B368))","v":""},{"$f":"IF(B368=\"\",\"\",RANK(C368,$C$11:$C$500)+COUNTIF($C$11:C368,C368)-1)","v":""},"","",""]
[{"$f":"IF('Incident Log'!C369=\"\",\"\",'Incident Log'!C369)","v":""},{"$f":"IFERROR(INDEX($A$11:$A$500, MATCH(0, COUNTIF($B$10:B368, $A$11:$A$500), 0)),\"\")","v":""},{"$f":"IF(B369=\"\",\"\",COUNTIF('Incident Log'!$C$11:$C$500,B369))","v":""},{"$f":"IF(B369=\"\",\"\",RANK(C369,$C$11:$C$500)+COUNTIF($C$11:C369,C369)-1)","v":""},"","",""]
[{"$f":"IF('Incident Log'!C370=\"\",\"\",'Incident Log'!C370)","v":""},{"$f":"IFERROR(INDEX($A$11:$A$500, MATCH(0, COUNTIF($B$10:B369, $A$11:$A$500), 0)),\"\")","v":""},{"$f":"IF(B370=\"\",\"\",COUNTIF('Incident Log'!$C$11:$C$500,B370))","v":""},{"$f":"IF(B370=\"\",\"\",RANK(C370,$C$11:$C$500)+COUNTIF($C$11:C370,C370)-1)","v":""},"","",""]
[{"$f":"IF('Incident Log'!C371=\"\",\"\",'Incident Log'!C371)","v":""},{"$f":"IFERROR(INDEX($A$11:$A$500, MATCH(0, COUNTIF($B$10:B370, $A$11:$A$500), 0)),\"\")","v":""},{"$f":"IF(B371=\"\",\"\",COUNTIF('Incident Log'!$C$11:$C$500,B371))","v":""},{"$f":"IF(B371=\"\",\"\",RANK(C371,$C$11:$C$500)+COUNTIF($C$11:C371,C371)-1)","v":""},"","",""]
[{"$f":"IF('Incident Log'!C372=\"\",\"\",'Incident Log'!C372)","v":""},{"$f":"IFERROR(INDEX($A$11:$A$500, MATCH(0, COUNTIF($B$10:B371, $A$11:$A$500), 0)),\"\")","v":""},{"$f":"IF(B372=\"\",\"\",COUNTIF('Incident Log'!$C$11:$C$500,B372))","v":""},{"$f":"IF(B372=\"\",\"\",RANK(C372,$C$11:$C$500)+COUNTIF($C$11:C372,C372)-1)","v":""},"","",""]
[{"$f":"IF('Incident Log'!C373=\"\",\"\",'Incident Log'!C373)","v":""},{"$f":"IFERROR(INDEX($A$11:$A$500, MATCH(0, COUNTIF($B$10:B372, $A$11:$A$500), 0)),\"\")","v":""},{"$f":"IF(B373=\"\",\"\",COUNTIF('Incident Log'!$C$11:$C$500,B373))","v":""},{"$f":"IF(B373=\"\",\"\",RANK(C373,$C$11:$C$500)+COUNTIF($C$11:C373,C373)-1)","v":""},"","",""]
[{"$f":"IF('Incident Log'!C374=\"\",\"\",'Incident Log'!C374)","v":""},{"$f":"IFERROR(INDEX($A$11:$A$500, MATCH(0, COUNTIF($B$10:B373, $A$11:$A$500), 0)),\"\")","v":""},{"$f":"IF(B374=\"\",\"\",COUNTIF('Incident Log'!$C$11:$C$500,B374))","v":""},{"$f":"IF(B374=\"\",\"\",RANK(C374,$C$11:$C$500)+COUNTIF($C$11:C374,C374)-1)","v":""},"","",""]
[{"$f":"IF('Incident Log'!C375=\"\",\"\",'Incident Log'!C375)","v":""},{"$f":"IFERROR(INDEX($A$11:$A$500, MATCH(0, COUNTIF($B$10:B374, $A$11:$A$500), 0)),\"\")","v":""},{"$f":"IF(B375=\"\",\"\",COUNTIF('Incident Log'!$C$11:$C$500,B375))","v":""},{"$f":"IF(B375=\"\",\"\",RANK(C375,$C$11:$C$500)+COUNTIF($C$11:C375,C375)-1)","v":""},"","",""]
[{"$f":"IF('Incident Log'!C376=\"\",\"\",'Incident Log'!C376)","v":""},{"$f":"IFERROR(INDEX($A$11:$A$500, MATCH(0, COUNTIF($B$10:B375, $A$11:$A$500), 0)),\"\")","v":""},{"$f":"IF(B376=\"\",\"\",COUNTIF('Incident Log'!$C$11:$C$500,B376))","v":""},{"$f":"IF(B376=\"\",\"\",RANK(C376,$C$11:$C$500)+COUNTIF($C$11:C376,C376)-1)","v":""},"","",""]
[{"$f":"IF('Incident Log'!C377=\"\",\"\",'Incident Log'!C377)","v":""},{"$f":"IFERROR(INDEX($A$11:$A$500, MATCH(0, COUNTIF($B$10:B376, $A$11:$A$500), 0)),\"\")","v":""},{"$f":"IF(B377=\"\",\"\",COUNTIF('Incident Log'!$C$11:$C$500,B377))","v":""},{"$f":"IF(B377=\"\",\"\",RANK(C377,$C$11:$C$500)+COUNTIF($C$11:C377,C377)-1)","v":""},"","",""]
[{"$f":"IF('Incident Log'!C378=\"\",\"\",'Incident Log'!C378)","v":""},{"$f":"IFERROR(INDEX($A$11:$A$500, MATCH(0, COUNTIF($B$10:B377, $A$11:$A$500), 0)),\"\")","v":""},{"$f":"IF(B378=\"\",\"\",COUNTIF('Incident Log'!$C$11:$C$500,B378))","v":""},{"$f":"IF(B378=\"\",\"\",RANK(C378,$C$11:$C$500)+COUNTIF($C$11:C378,C378)-1)","v":""},"","",""]
[{"$f":"IF('Incident Log'!C379=\"\",\"\",'Incident Log'!C379)","v":""},{"$f":"IFERROR(INDEX($A$11:$A$500, MATCH(0, COUNTIF($B$10:B378, $A$11:$A$500), 0)),\"\")","v":""},{"$f":"IF(B379=\"\",\"\",COUNTIF('Incident Log'!$C$11:$C$500,B379))","v":""},{"$f":"IF(B379=\"\",\"\",RANK(C379,$C$11:$C$500)+COUNTIF($C$11:C379,C379)-1)","v":""},"","",""]
[{"$f":"IF('Incident Log'!C380=\"\",\"\",'Incident Log'!C380)","v":""},{"$f":"IFERROR(INDEX($A$11:$A$500, MATCH(0, COUNTIF($B$10:B379, $A$11:$A$500), 0)),\"\")","v":""},{"$f":"IF(B380=\"\",\"\",COUNTIF('Incident Log'!$C$11:$C$500,B380))","v":""},{"$f":"IF(B380=\"\",\"\",RANK(C380,$C$11:$C$500)+COUNTIF($C$11:C380,C380)-1)","v":""},"","",""]
[{"$f":"IF('Incident Log'!C381=\"\",\"\",'Incident Log'!C381)","v":""},{"$f":"IFERROR(INDEX($A$11:$A$500, MATCH(0, COUNTIF($B$10:B380, $A$11:$A$500), 0)),\"\")","v":""},{"$f":"IF(B381=\"\",\"\",COUNTIF('Incident Log'!$C$11:$C$500,B381))","v":""},{"$f":"IF(B381=\"\",\"\",RANK(C381,$C$11:$C$500)+COUNTIF($C$11:C381,C381)-1)","v":""},"","",""]
[{"$f":"IF('Incident Log'!C382=\"\",\"\",'Incident Log'!C382)","v":""},{"$f":"IFERROR(INDEX($A$11:$A$500, MATCH(0, COUNTIF($B$10:B381, $A$11:$A$500), 0)),\"\")","v":""},{"$f":"IF(B382=\"\",\"\",COUNTIF('Incident Log'!$C$11:$C$500,B382))","v":""},{"$f":"IF(B382=\"\",\"\",RANK(C382,$C$11:$C$500)+COUNTIF($C$11:C382,C382)-1)","v":""},"","",""]
[{"$f":"IF('Incident Log'!C383=\"\",\"\",'Incident Log'!C383)","v":""},{"$f":"IFERROR(INDEX($A$11:$A$500, MATCH(0, COUNTIF($B$10:B382, $A$11:$A$500), 0)),\"\")","v":""},{"$f":"IF(B383=\"\",\"\",COUNTIF('Incident Log'!$C$11:$C$500,B383))","v":""},{"$f":"IF(B383=\"\",\"\",RANK(C383,$C$11:$C$500)+COUNTIF($C$11:C383,C383)-1)","v":""},"","",""]
[{"$f":"IF('Incident Log'!C384=\"\",\"\",'Incident Log'!C384)","v":""},{"$f":"IFERROR(INDEX($A$11:$A$500, MATCH(0, COUNTIF($B$10:B383, $A$11:$A$500), 0)),\"\")","v":""},{"$f":"IF(B384=\"\",\"\",COUNTIF('Incident Log'!$C$11:$C$500,B384))","v":""},{"$f":"IF(B384=\"\",\"\",RANK(C384,$C$11:$C$500)+COUNTIF($C$11:C384,C384)-1)","v":""},"","",""]
[{"$f":"IF('Incident Log'!C385=\"\",\"\",'Incident Log'!C385)","v":""},{"$f":"IFERROR(INDEX($A$11:$A$500, MATCH(0, COUNTIF($B$10:B384, $A$11:$A$500), 0)),\"\")","v":""},{"$f":"IF(B385=\"\",\"\",COUNTIF('Incident Log'!$C$11:$C$500,B385))","v":""},{"$f":"IF(B385=\"\",\"\",RANK(C385,$C$11:$C$500)+COUNTIF($C$11:C385,C385)-1)","v":""},"","",""]
[{"$f":"IF('Incident Log'!C386=\"\",\"\",'Incident Log'!C386)","v":""},{"$f":"IFERROR(INDEX($A$11:$A$500, MATCH(0, COUNTIF($B$10:B385, $A$11:$A$500), 0)),\"\")","v":""},{"$f":"IF(B386=\"\",\"\",COUNTIF('Incident Log'!$C$11:$C$500,B386))","v":""},{"$f":"IF(B386=\"\",\"\",RANK(C386,$C$11:$C$500)+COUNTIF($C$11:C386,C386)-1)","v":""},"","",""]
[{"$f":"IF('Incident Log'!C387=\"\",\"\",'Incident Log'!C387)","v":""},{"$f":"IFERROR(INDEX($A$11:$A$500, MATCH(0, COUNTIF($B$10:B386, $A$11:$A$500), 0)),\"\")","v":""},{"$f":"IF(B387=\"\",\"\",COUNTIF('Incident Log'!$C$11:$C$500,B387))","v":""},{"$f":"IF(B387=\"\",\"\",RANK(C387,$C$11:$C$500)+COUNTIF($C$11:C387,C387)-1)","v":""},"","",""]
[{"$f":"IF('Incident Log'!C388=\"\",\"\",'Incident Log'!C388)","v":""},{"$f":"IFERROR(INDEX($A$11:$A$500, MATCH(0, COUNTIF($B$10:B387, $A$11:$A$500), 0)),\"\")","v":""},{"$f":"IF(B388=\"\",\"\",COUNTIF('Incident Log'!$C$11:$C$500,B388))","v":""},{"$f":"IF(B388=\"\",\"\",RANK(C388,$C$11:$C$500)+COUNTIF($C$11:C388,C388)-1)","v":""},"","",""]
[{"$f":"IF('Incident Log'!C389=\"\",\"\",'Incident Log'!C389)","v":""},{"$f":"IFERROR(INDEX($A$11:$A$500, MATCH(0, COUNTIF($B$10:B388, $A$11:$A$500), 0)),\"\")","v":""},{"$f":"IF(B389=\"\",\"\",COUNTIF('Incident Log'!$C$11:$C$500,B389))","v":""},{"$f":"IF(B389=\"\",\"\",RANK(C389,$C$11:$C$500)+COUNTIF($C$11:C389,C389)-1)","v":""},"","",""]
[{"$f":"IF('Incident Log'!C390=\"\",\"\",'Incident Log'!C390)","v":""},{"$f":"IFERROR(INDEX($A$11:$A$500, MATCH(0, COUNTIF($B$10:B389, $A$11:$A$500), 0)),\"\")","v":""},{"$f":"IF(B390=\"\",\"\",COUNTIF('Incident Log'!$C$11:$C$500,B390))","v":""},{"$f":"IF(B390=\"\",\"\",RANK(C390,$C$11:$C$500)+COUNTIF($C$11:C390,C390)-1)","v":""},"","",""]
[{"$f":"IF('Incident Log'!C391=\"\",\"\",'Incident Log'!C391)","v":""},{"$f":"IFERROR(INDEX($A$11:$A$500, MATCH(0, COUNTIF($B$10:B390, $A$11:$A$500), 0)),\"\")","v":""},{"$f":"IF(B391=\"\",\"\",COUNTIF('Incident Log'!$C$11:$C$500,B391))","v":""},{"$f":"IF(B391=\"\",\"\",RANK(C391,$C$11:$C$500)+COUNTIF($C$11:C391,C391)-1)","v":""},"","",""]
[{"$f":"IF('Incident Log'!C392=\"\",\"\",'Incident Log'!C392)","v":""},{"$f":"IFERROR(INDEX($A$11:$A$500, MATCH(0, COUNTIF($B$10:B391, $A$11:$A$500), 0)),\"\")","v":""},{"$f":"IF(B392=\"\",\"\",COUNTIF('Incident Log'!$C$11:$C$500,B392))","v":""},{"$f":"IF(B392=\"\",\"\",RANK(C392,$C$11:$C$500)+COUNTIF($C$11:C392,C392)-1)","v":""},"","",""]
[{"$f":"IF('Incident Log'!C393=\"\",\"\",'Incident Log'!C393)","v":""},{"$f":"IFERROR(INDEX($A$11:$A$500, MATCH(0, COUNTIF($B$10:B392, $A$11:$A$500), 0)),\"\")","v":""},{"$f":"IF(B393=\"\",\"\",COUNTIF('Incident Log'!$C$11:$C$500,B393))","v":""},{"$f":"IF(B393=\"\",\"\",RANK(C393,$C$11:$C$500)+COUNTIF($C$11:C393,C393)-1)","v":""},"","",""]
[{"$f":"IF('Incident Log'!C394=\"\",\"\",'Incident Log'!C394)","v":""},{"$f":"IFERROR(INDEX($A$11:$A$500, MATCH(0, COUNTIF($B$10:B393, $A$11:$A$500), 0)),\"\")","v":""},{"$f":"IF(B394=\"\",\"\",COUNTIF('Incident Log'!$C$11:$C$500,B394))","v":""},{"$f":"IF(B394=\"\",\"\",RANK(C394,$C$11:$C$500)+COUNTIF($C$11:C394,C394)-1)","v":""},"","",""]
[{"$f":"IF('Incident Log'!C395=\"\",\"\",'Incident Log'!C395)","v":""},{"$f":"IFERROR(INDEX($A$11:$A$500, MATCH(0, COUNTIF($B$10:B394, $A$11:$A$500), 0)),\"\")","v":""},{"$f":"IF(B395=\"\",\"\",COUNTIF('Incident Log'!$C$11:$C$500,B395))","v":""},{"$f":"IF(B395=\"\",\"\",RANK(C395,$C$11:$C$500)+COUNTIF($C$11:C395,C395)-1)","v":""},"","",""]
[{"$f":"IF('Incident Log'!C396=\"\",\"\",'Incident Log'!C396)","v":""},{"$f":"IFERROR(INDEX($A$11:$A$500, MATCH(0, COUNTIF($B$10:B395, $A$11:$A$500), 0)),\"\")","v":""},{"$f":"IF(B396=\"\",\"\",COUNTIF('Incident Log'!$C$11:$C$500,B396))","v":""},{"$f":"IF(B396=\"\",\"\",RANK(C396,$C$11:$C$500)+COUNTIF($C$11:C396,C396)-1)","v":""},"",{"$f":"IF(B396=\"\",\"\",INDEX($B$11:$B$500,MATCH(E396,$D$11:$D$500,0)))","v":""},{"$f":"IF(B396=\"\",\"\",VLOOKUP(F396,$B$11:$C$500,2,FALSE))","v":""}]
[{"$f":"IF('Incident Log'!C397=\"\",\"\",'Incident Log'!C397)","v":""},{"$f":"IFERROR(INDEX($A$11:$A$500, MATCH(0, COUNTIF($B$10:B396, $A$11:$A$500), 0)),\"\")","v":""},{"$f":"IF(B397=\"\",\"\",COUNTIF('Incident Log'!$C$11:$C$500,B397))","v":""},{"$f":"IF(B397=\"\",\"\",RANK(C397,$C$11:$C$500)+COUNTIF($C$11:C397,C397)-1)","v":""},"","",""]
[{"$f":"IF('Incident Log'!C398=\"\",\"\",'Incident Log'!C398)","v":""},{"$f":"IFERROR(INDEX($A$11:$A$500, MATCH(0, COUNTIF($B$10:B397, $A$11:$A$500), 0)),\"\")","v":""},{"$f":"IF(B398=\"\",\"\",COUNTIF('Incident Log'!$C$11:$C$500,B398))","v":""},{"$f":"IF(B398=\"\",\"\",RANK(C398,$C$11:$C$500)+COUNTIF($C$11:C398,C398)-1)","v":""},{"$f":"IF(B398=\"\",\"\",1+E397)","v":""},"",""]
[{"$f":"IF('Incident Log'!C399=\"\",\"\",'Incident Log'!C399)","v":""},{"$f":"IFERROR(INDEX($A$11:$A$500, MATCH(0, COUNTIF($B$10:B398, $A$11:$A$500), 0)),\"\")","v":""},{"$f":"IF(B399=\"\",\"\",COUNTIF('Incident Log'!$C$11:$C$500,B399))","v":""},{"$f":"IF(B399=\"\",\"\",RANK(C399,$C$11:$C$500)+COUNTIF($C$11:C399,C399)-1)","v":""},"","",""]
[{"$f":"IF('Incident Log'!C400=\"\",\"\",'Incident Log'!C400)","v":""},{"$f":"IFERROR(INDEX($A$11:$A$500, MATCH(0, COUNTIF($B$10:B399, $A$11:$A$500), 0)),\"\")","v":""},{"$f":"IF(B400=\"\",\"\",COUNTIF('Incident Log'!$C$11:$C$500,B400))","v":""},{"$f":"IF(B400=\"\",\"\",RANK(C400,$C$11:$C$500)+COUNTIF($C$11:C400,C400)-1)","v":""},"","",""]
[{"$f":"IF('Incident Log'!C401=\"\",\"\",'Incident Log'!C401)","v":""},{"$f":"IFERROR(INDEX($A$11:$A$500, MATCH(0, COUNTIF($B$10:B400, $A$11:$A$500), 0)),\"\")","v":""},{"$f":"IF(B401=\"\",\"\",COUNTIF('Incident Log'!$C$11:$C$500,B401))","v":""},{"$f":"IF(B401=\"\",\"\",RANK(C401,$C$11:$C$500)+COUNTIF($C$11:C401,C401)-1)","v":""},"","",""]
[{"$f":"IF('Incident Log'!C402=\"\",\"\",'Incident Log'!C402)","v":""},{"$f":"IFERROR(INDEX($A$11:$A$500, MATCH(0, COUNTIF($B$10:B401, $A$11:$A$500), 0)),\"\")","v":""},{"$f":"IF(B402=\"\",\"\",COUNTIF('Incident Log'!$C$11:$C$500,B402))","v":""},{"$f":"IF(B402=\"\",\"\",RANK(C402,$C$11:$C$500)+COUNTIF($C$11:C402,C402)-1)","v":""},"","",""]
[{"$f":"IF('Incident Log'!C403=\"\",\"\",'Incident Log'!C403)","v":""},{"$f":"IFERROR(INDEX($A$11:$A$500, MATCH(0, COUNTIF($B$10:B402, $A$11:$A$500), 0)),\"\")","v":""},{"$f":"IF(B403=\"\",\"\",COUNTIF('Incident Log'!$C$11:$C$500,B403))","v":""},{"$f":"IF(B403=\"\",\"\",RANK(C403,$C$11:$C$500)+COUNTIF($C$11:C403,C403)-1)","v":""},"","",""]
[{"$f":"IF('Incident Log'!C404=\"\",\"\",'Incident Log'!C404)","v":""},{"$f":"IFERROR(INDEX($A$11:$A$500, MATCH(0, COUNTIF($B$10:B403, $A$11:$A$500), 0)),\"\")","v":""},{"$f":"IF(B404=\"\",\"\",COUNTIF('Incident Log'!$C$11:$C$500,B404))","v":""},{"$f":"IF(B404=\"\",\"\",RANK(C404,$C$11:$C$500)+COUNTIF($C$11:C404,C404)-1)","v":""},"","",""]
[{"$f":"IF('Incident Log'!C405=\"\",\"\",'Incident Log'!C405)","v":""},{"$f":"IFERROR(INDEX($A$11:$A$500, MATCH(0, COUNTIF($B$10:B404, $A$11:$A$500), 0)),\"\")","v":""},{"$f":"IF(B405=\"\",\"\",COUNTIF('Incident Log'!$C$11:$C$500,B405))","v":""},{"$f":"IF(B405=\"\",\"\",RANK(C405,$C$11:$C$500)+COUNTIF($C$11:C405,C405)-1)","v":""},"","",""]
[{"$f":"IF('Incident Log'!C406=\"\",\"\",'Incident Log'!C406)","v":""},{"$f":"IFERROR(INDEX($A$11:$A$500, MATCH(0, COUNTIF($B$10:B405, $A$11:$A$500), 0)),\"\")","v":""},{"$f":"IF(B406=\"\",\"\",COUNTIF('Incident Log'!$C$11:$C$500,B406))","v":""},{"$f":"IF(B406=\"\",\"\",RANK(C406,$C$11:$C$500)+COUNTIF($C$11:C406,C406)-1)","v":""},"","",""]
[{"$f":"IF('Incident Log'!C407=\"\",\"\",'Incident Log'!C407)","v":""},{"$f":"IFERROR(INDEX($A$11:$A$500, MATCH(0, COUNTIF($B$10:B406, $A$11:$A$500), 0)),\"\")","v":""},{"$f":"IF(B407=\"\",\"\",COUNTIF('Incident Log'!$C$11:$C$500,B407))","v":""},{"$f":"IF(B407=\"\",\"\",RANK(C407,$C$11:$C$500)+COUNTIF($C$11:C407,C407)-1)","v":""},"","",""]
[{"$f":"IF('Incident Log'!C408=\"\",\"\",'Incident Log'!C408)","v":""},{"$f":"IFERROR(INDEX($A$11:$A$500, MATCH(0, COUNTIF($B$10:B407, $A$11:$A$500), 0)),\"\")","v":""},{"$f":"IF(B408=\"\",\"\",COUNTIF('Incident Log'!$C$11:$C$500,B408))","v":""},{"$f":"IF(B408=\"\",\"\",RANK(C408,$C$11:$C$500)+COUNTIF($C$11:C408,C408)-1)","v":""},"","",""]
[{"$f":"IF('Incident Log'!C409=\"\",\"\",'Incident Log'!C409)","v":""},{"$f":"IFERROR(INDEX($A$11:$A$500, MATCH(0, COUNTIF($B$10:B408, $A$11:$A$500), 0)),\"\")","v":""},{"$f":"IF(B409=\"\",\"\",COUNTIF('Incident Log'!$C$11:$C$500,B409))","v":""},{"$f":"IF(B409=\"\",\"\",RANK(C409,$C$11:$C$500)+COUNTIF($C$11:C409,C409)-1)","v":""},"","",""]
[{"$f":"IF('Incident Log'!C410=\"\",\"\",'Incident Log'!C410)","v":""},{"$f":"IFERROR(INDEX($A$11:$A$500, MATCH(0, COUNTIF($B$10:B409, $A$11:$A$500), 0)),\"\")","v":""},{"$f":"IF(B410=\"\",\"\",COUNTIF('Incident Log'!$C$11:$C$500,B410))","v":""},{"$f":"IF(B410=\"\",\"\",RANK(C410,$C$11:$C$500)+COUNTIF($C$11:C410,C410)-1)","v":""},"","",""]
[{"$f":"IF('Incident Log'!C411=\"\",\"\",'Incident Log'!C411)","v":""},{"$f":"IFERROR(INDEX($A$11:$A$500, MATCH(0, COUNTIF($B$10:B410, $A$11:$A$500), 0)),\"\")","v":""},{"$f":"IF(B411=\"\",\"\",COUNTIF('Incident Log'!$C$11:$C$500,B411))","v":""},{"$f":"IF(B411=\"\",\"\",RANK(C411,$C$11:$C$500)+COUNTIF($C$11:C411,C411)-1)","v":""},"","",""]
[{"$f":"IF('Incident Log'!C412=\"\",\"\",'Incident Log'!C412)","v":""},{"$f":"IFERROR(INDEX($A$11:$A$500, MATCH(0, COUNTIF($B$10:B411, $A$11:$A$500), 0)),\"\")","v":""},{"$f":"IF(B412=\"\",\"\",COUNTIF('Incident Log'!$C$11:$C$500,B412))","v":""},{"$f":"IF(B412=\"\",\"\",RANK(C412,$C$11:$C$500)+COUNTIF($C$11:C412,C412)-1)","v":""},"","",""]
[{"$f":"IF('Incident Log'!C413=\"\",\"\",'Incident Log'!C413)","v":""},{"$f":"IFERROR(INDEX($A$11:$A$500, MATCH(0, COUNTIF($B$10:B412, $A$11:$A$500), 0)),\"\")","v":""},{"$f":"IF(B413=\"\",\"\",COUNTIF('Incident Log'!$C$11:$C$500,B413))","v":""},{"$f":"IF(B413=\"\",\"\",RANK(C413,$C$11:$C$500)+COUNTIF($C$11:C413,C413)-1)","v":""},"","",""]
[{"$f":"IF('Incident Log'!C414=\"\",\"\",'Incident Log'!C414)","v":""},{"$f":"IFERROR(INDEX($A$11:$A$500, MATCH(0, COUNTIF($B$10:B413, $A$11:$A$500), 0)),\"\")","v":""},{"$f":"IF(B414=\"\",\"\",COUNTIF('Incident Log'!$C$11:$C$500,B414))","v":""},{"$f":"IF(B414=\"\",\"\",RANK(C414,$C$11:$C$500)+COUNTIF($C$11:C414,C414)-1)","v":""},"","",""]
[{"$f":"IF('Incident Log'!C415=\"\",\"\",'Incident Log'!C415)","v":""},{"$f":"IFERROR(INDEX($A$11:$A$500, MATCH(0, COUNTIF($B$10:B414, $A$11:$A$500), 0)),\"\")","v":""},{"$f":"IF(B415=\"\",\"\",COUNTIF('Incident Log'!$C$11:$C$500,B415))","v":""},{"$f":"IF(B415=\"\",\"\",RANK(C415,$C$11:$C$500)+COUNTIF($C$11:C415,C415)-1)","v":""},"","",""]
[{"$f":"IF('Incident Log'!C416=\"\",\"\",'Incident Log'!C416)","v":""},{"$f":"IFERROR(INDEX($A$11:$A$500, MATCH(0, COUNTIF($B$10:B415, $A$11:$A$500), 0)),\"\")","v":""},{"$f":"IF(B416=\"\",\"\",COUNTIF('Incident Log'!$C$11:$C$500,B416))","v":""},{"$f":"IF(B416=\"\",\"\",RANK(C416,$C$11:$C$500)+COUNTIF($C$11:C416,C416)-1)","v":""},"","",""]
[{"$f":"IF('Incident Log'!C417=\"\",\"\",'Incident Log'!C417)","v":""},{"$f":"IFERROR(INDEX($A$11:$A$500, MATCH(0, COUNTIF($B$10:B416, $A$11:$A$500), 0)),\"\")","v":""},{"$f":"IF(B417=\"\",\"\",COUNTIF('Incident Log'!$C$11:$C$500,B417))","v":""},{"$f":"IF(B417=\"\",\"\",RANK(C417,$C$11:$C$500)+COUNTIF($C$11:C417,C417)-1)","v":""},"","",""]
[{"$f":"IF('Incident Log'!C418=\"\",\"\",'Incident Log'!C418)","v":""},{"$f":"IFERROR(INDEX($A$11:$A$500, MATCH(0, COUNTIF($B$10:B417, $A$11:$A$500), 0)),\"\")","v":""},{"$f":"IF(B418=\"\",\"\",COUNTIF('Incident Log'!$C$11:$C$500,B418))","v":""},{"$f":"IF(B418=\"\",\"\",RANK(C418,$C$11:$C$500)+COUNTIF($C$11:C418,C418)-1)","v":""},"","",""]
[{"$f":"IF('Incident Log'!C419=\"\",\"\",'Incident Log'!C419)","v":""},{"$f":"IFERROR(INDEX($A$11:$A$500, MATCH(0, COUNTIF($B$10:B418, $A$11:$A$500), 0)),\"\")","v":""},{"$f":"IF(B419=\"\",\"\",COUNTIF('Incident Log'!$C$11:$C$500,B419))","v":""},{"$f":"IF(B419=\"\",\"\",RANK(C419,$C$11:$C$500)+COUNTIF($C$11:C419,C419)-1)","v":""},"","",""]
[{"$f":"IF('Incident Log'!C420=\"\",\"\",'Incident Log'!C420)","v":""},{"$f":"IFERROR(INDEX($A$11:$A$500, MATCH(0, COUNTIF($B$10:B419, $A$11:$A$500), 0)),\"\")","v":""},{"$f":"IF(B420=\"\",\"\",COUNTIF('Incident Log'!$C$11:$C$500,B420))","v":""},{"$f":"IF(B420=\"\",\"\",RANK(C420,$C$11:$C$500)+COUNTIF($C$11:C420,C420)-1)","v":""},"","",""]
[{"$f":"IF('Incident Log'!C421=\"\",\"\",'Incident Log'!C421)","v":""},{"$f":"IFERROR(INDEX($A$11:$A$500, MATCH(0, COUNTIF($B$10:B420, $A$11:$A$500), 0)),\"\")","v":""},{"$f":"IF(B421=\"\",\"\",COUNTIF('Incident Log'!$C$11:$C$500,B421))","v":""},{"$f":"IF(B421=\"\",\"\",RANK(C421,$C$11:$C$500)+COUNTIF($C$11:C421,C421)-1)","v":""},"","",""]
[{"$f":"IF('Incident Log'!C422=\"\",\"\",'Incident Log'!C422)","v":""},{"$f":"IFERROR(INDEX($A$11:$A$500, MATCH(0, COUNTIF($B$10:B421, $A$11:$A$500), 0)),\"\")","v":""},{"$f":"IF(B422=\"\",\"\",COUNTIF('Incident Log'!$C$11:$C$500,B422))","v":""},{"$f":"IF(B422=\"\",\"\",RANK(C422,$C$11:$C$500)+COUNTIF($C$11:C422,C422)-1)","v":""},"","",""]
[{"$f":"IF('Incident Log'!C423=\"\",\"\",'Incident Log'!C423)","v":""},{"$f":"IFERROR(INDEX($A$11:$A$500, MATCH(0, COUNTIF($B$10:B422, $A$11:$A$500), 0)),\"\")","v":""},{"$f":"IF(B423=\"\",\"\",COUNTIF('Incident Log'!$C$11:$C$500,B423))","v":""},{"$f":"IF(B423=\"\",\"\",RANK(C423,$C$11:$C$500)+COUNTIF($C$11:C423,C423)-1)","v":""},"","",""]
[{"$f":"IF('Incident Log'!C424=\"\",\"\",'Incident Log'!C424)","v":""},{"$f":"IFERROR(INDEX($A$11:$A$500, MATCH(0, COUNTIF($B$10:B423, $A$11:$A$500), 0)),\"\")","v":""},{"$f":"IF(B424=\"\",\"\",COUNTIF('Incident Log'!$C$11:$C$500,B424))","v":""},{"$f":"IF(B424=\"\",\"\",RANK(C424,$C$11:$C$500)+COUNTIF($C$11:C424,C424)-1)","v":""},"","",""]
[{"$f":"IF('Incident Log'!C425=\"\",\"\",'Incident Log'!C425)","v":""},{"$f":"IFERROR(INDEX($A$11:$A$500, MATCH(0, COUNTIF($B$10:B424, $A$11:$A$500), 0)),\"\")","v":""},{"$f":"IF(B425=\"\",\"\",COUNTIF('Incident Log'!$C$11:$C$500,B425))","v":""},{"$f":"IF(B425=\"\",\"\",RANK(C425,$C$11:$C$500)+COUNTIF($C$11:C425,C425)-1)","v":""},"","",""]
[{"$f":"IF('Incident Log'!C426=\"\",\"\",'Incident Log'!C426)","v":""},{"$f":"IFERROR(INDEX($A$11:$A$500, MATCH(0, COUNTIF($B$10:B425, $A$11:$A$500), 0)),\"\")","v":""},{"$f":"IF(B426=\"\",\"\",COUNTIF('Incident Log'!$C$11:$C$500,B426))","v":""},{"$f":"IF(B426=\"\",\"\",RANK(C426,$C$11:$C$500)+COUNTIF($C$11:C426,C426)-1)","v":""},"","",""]
[{"$f":"IF('Incident Log'!C427=\"\",\"\",'Incident Log'!C427)","v":""},{"$f":"IFERROR(INDEX($A$11:$A$500, MATCH(0, COUNTIF($B$10:B426, $A$11:$A$500), 0)),\"\")","v":""},{"$f":"IF(B427=\"\",\"\",COUNTIF('Incident Log'!$C$11:$C$500,B427))","v":""},{"$f":"IF(B427=\"\",\"\",RANK(C427,$C$11:$C$500)+COUNTIF($C$11:C427,C427)-1)","v":""},"","",""]
[{"$f":"IF('Incident Log'!C428=\"\",\"\",'Incident Log'!C428)","v":""},{"$f":"IFERROR(INDEX($A$11:$A$500, MATCH(0, COUNTIF($B$10:B427, $A$11:$A$500), 0)),\"\")","v":""},{"$f":"IF(B428=\"\",\"\",COUNTIF('Incident Log'!$C$11:$C$500,B428))","v":""},{"$f":"IF(B428=\"\",\"\",RANK(C428,$C$11:$C$500)+COUNTIF($C$11:C428,C428)-1)","v":""},"","",""]
[{"$f":"IF('Incident Log'!C429=\"\",\"\",'Incident Log'!C429)","v":""},{"$f":"IFERROR(INDEX($A$11:$A$500, MATCH(0, COUNTIF($B$10:B428, $A$11:$A$500), 0)),\"\")","v":""},{"$f":"IF(B429=\"\",\"\",COUNTIF('Incident Log'!$C$11:$C$500,B429))","v":""},{"$f":"IF(B429=\"\",\"\",RANK(C429,$C$11:$C$500)+COUNTIF($C$11:C429,C429)-1)","v":""},"","",""]
[{"$f":"IF('Incident Log'!C430=\"\",\"\",'Incident Log'!C430)","v":""},{"$f":"IFERROR(INDEX($A$11:$A$500, MATCH(0, COUNTIF($B$10:B429, $A$11:$A$500), 0)),\"\")","v":""},{"$f":"IF(B430=\"\",\"\",COUNTIF('Incident Log'!$C$11:$C$500,B430))","v":""},{"$f":"IF(B430=\"\",\"\",RANK(C430,$C$11:$C$500)+COUNTIF($C$11:C430,C430)-1)","v":""},"","",""]
[{"$f":"IF('Incident Log'!C431=\"\",\"\",'Incident Log'!C431)","v":""},{"$f":"IFERROR(INDEX($A$11:$A$500, MATCH(0, COUNTIF($B$10:B430, $A$11:$A$500), 0)),\"\")","v":""},{"$f":"IF(B431=\"\",\"\",COUNTIF('Incident Log'!$C$11:$C$500,B431))","v":""},{"$f":"IF(B431=\"\",\"\",RANK(C431,$C$11:$C$500)+COUNTIF($C$11:C431,C431)-1)","v":""},"","",""]
[{"$f":"IF('Incident Log'!C432=\"\",\"\",'Incident Log'!C432)","v":""},{"$f":"IFERROR(INDEX($A$11:$A$500, MATCH(0, COUNTIF($B$10:B431, $A$11:$A$500), 0)),\"\")","v":""},{"$f":"IF(B432=\"\",\"\",COUNTIF('Incident Log'!$C$11:$C$500,B432))","v":""},{"$f":"IF(B432=\"\",\"\",RANK(C432,$C$11:$C$500)+COUNTIF($C$11:C432,C432)-1)","v":""},"","",""]
[{"$f":"IF('Incident Log'!C433=\"\",\"\",'Incident Log'!C433)","v":""},{"$f":"IFERROR(INDEX($A$11:$A$500, MATCH(0, COUNTIF($B$10:B432, $A$11:$A$500), 0)),\"\")","v":""},{"$f":"IF(B433=\"\",\"\",COUNTIF('Incident Log'!$C$11:$C$500,B433))","v":""},{"$f":"IF(B433=\"\",\"\",RANK(C433,$C$11:$C$500)+COUNTIF($C$11:C433,C433)-1)","v":""},"","",""]
[{"$f":"IF('Incident Log'!C434=\"\",\"\",'Incident Log'!C434)","v":""},{"$f":"IFERROR(INDEX($A$11:$A$500, MATCH(0, COUNTIF($B$10:B433, $A$11:$A$500), 0)),\"\")","v":""},{"$f":"IF(B434=\"\",\"\",COUNTIF('Incident Log'!$C$11:$C$500,B434))","v":""},{"$f":"IF(B434=\"\",\"\",RANK(C434,$C$11:$C$500)+COUNTIF($C$11:C434,C434)-1)","v":""},"","",""]
[{"$f":"IF('Incident Log'!C435=\"\",\"\",'Incident Log'!C435)","v":""},{"$f":"IFERROR(INDEX($A$11:$A$500, MATCH(0, COUNTIF($B$10:B434, $A$11:$A$500), 0)),\"\")","v":""},{"$f":"IF(B435=\"\",\"\",COUNTIF('Incident Log'!$C$11:$C$500,B435))","v":""},{"$f":"IF(B435=\"\",\"\",RANK(C435,$C$11:$C$500)+COUNTIF($C$11:C435,C435)-1)","v":""},"","",""]
[{"$f":"IF('Incident Log'!C436=\"\",\"\",'Incident Log'!C436)","v":""},{"$f":"IFERROR(INDEX($A$11:$A$500, MATCH(0, COUNTIF($B$10:B435, $A$11:$A$500), 0)),\"\")","v":""},{"$f":"IF(B436=\"\",\"\",COUNTIF('Incident Log'!$C$11:$C$500,B436))","v":""},{"$f":"IF(B436=\"\",\"\",RANK(C436,$C$11:$C$500)+COUNTIF($C$11:C436,C436)-1)","v":""},"","",""]
[{"$f":"IF('Incident Log'!C437=\"\",\"\",'Incident Log'!C437)","v":""},{"$f":"IFERROR(INDEX($A$11:$A$500, MATCH(0, COUNTIF($B$10:B436, $A$11:$A$500), 0)),\"\")","v":""},{"$f":"IF(B437=\"\",\"\",COUNTIF('Incident Log'!$C$11:$C$500,B437))","v":""},{"$f":"IF(B437=\"\",\"\",RANK(C437,$C$11:$C$500)+COUNTIF($C$11:C437,C437)-1)","v":""},"","",""]
[{"$f":"IF('Incident Log'!C438=\"\",\"\",'Incident Log'!C438)","v":""},{"$f":"IFERROR(INDEX($A$11:$A$500, MATCH(0, COUNTIF($B$10:B437, $A$11:$A$500), 0)),\"\")","v":""},{"$f":"IF(B438=\"\",\"\",COUNTIF('Incident Log'!$C$11:$C$500,B438))","v":""},{"$f":"IF(B438=\"\",\"\",RANK(C438,$C$11:$C$500)+COUNTIF($C$11:C438,C438)-1)","v":""},"","",""]
[{"$f":"IF('Incident Log'!C439=\"\",\"\",'Incident Log'!C439)","v":""},{"$f":"IFERROR(INDEX($A$11:$A$500, MATCH(0, COUNTIF($B$10:B438, $A$11:$A$500), 0)),\"\")","v":""},{"$f":"IF(B439=\"\",\"\",COUNTIF('Incident Log'!$C$11:$C$500,B439))","v":""},{"$f":"IF(B439=\"\",\"\",RANK(C439,$C$11:$C$500)+COUNTIF($C$11:C439,C439)-1)","v":""},"","",""]
[{"$f":"IF('Incident Log'!C440=\"\",\"\",'Incident Log'!C440)","v":""},{"$f":"IFERROR(INDEX($A$11:$A$500, MATCH(0, COUNTIF($B$10:B439, $A$11:$A$500), 0)),\"\")","v":""},{"$f":"IF(B440=\"\",\"\",COUNTIF('Incident Log'!$C$11:$C$500,B440))","v":""},{"$f":"IF(B440=\"\",\"\",RANK(C440,$C$11:$C$500)+COUNTIF($C$11:C440,C440)-1)","v":""},"","",""]
[{"$f":"IF('Incident Log'!C441=\"\",\"\",'Incident Log'!C441)","v":""},{"$f":"IFERROR(INDEX($A$11:$A$500, MATCH(0, COUNTIF($B$10:B440, $A$11:$A$500), 0)),\"\")","v":""},{"$f":"IF(B441=\"\",\"\",COUNTIF('Incident Log'!$C$11:$C$500,B441))","v":""},{"$f":"IF(B441=\"\",\"\",RANK(C441,$C$11:$C$500)+COUNTIF($C$11:C441,C441)-1)","v":""},"","",""]
[{"$f":"IF('Incident Log'!C442=\"\",\"\",'Incident Log'!C442)","v":""},{"$f":"IFERROR(INDEX($A$11:$A$500, MATCH(0, COUNTIF($B$10:B441, $A$11:$A$500), 0)),\"\")","v":""},{"$f":"IF(B442=\"\",\"\",COUNTIF('Incident Log'!$C$11:$C$500,B442))","v":""},{"$f":"IF(B442=\"\",\"\",RANK(C442,$C$11:$C$500)+COUNTIF($C$11:C442,C442)-1)","v":""},"","",""]
[{"$f":"IF('Incident Log'!C443=\"\",\"\",'Incident Log'!C443)","v":""},{"$f":"IFERROR(INDEX($A$11:$A$500, MATCH(0, COUNTIF($B$10:B442, $A$11:$A$500), 0)),\"\")","v":""},{"$f":"IF(B443=\"\",\"\",COUNTIF('Incident Log'!$C$11:$C$500,B443))","v":""},{"$f":"IF(B443=\"\",\"\",RANK(C443,$C$11:$C$500)+COUNTIF($C$11:C443,C443)-1)","v":""},"","",""]
[{"$f":"IF('Incident Log'!C444=\"\",\"\",'Incident Log'!C444)","v":""},{"$f":"IFERROR(INDEX($A$11:$A$500, MATCH(0, COUNTIF($B$10:B443, $A$11:$A$500), 0)),\"\")","v":""},{"$f":"IF(B444=\"\",\"\",COUNTIF('Incident Log'!$C$11:$C$500,B444))","v":""},{"$f":"IF(B444=\"\",\"\",RANK(C444,$C$11:$C$500)+COUNTIF($C$11:C444,C444)-1)","v":""},"","",""]
[{"$f":"IF('Incident Log'!C445=\"\",\"\",'Incident Log'!C445)","v":""},{"$f":"IFERROR(INDEX($A$11:$A$500, MATCH(0, COUNTIF($B$10:B444, $A$11:$A$500), 0)),\"\")","v":""},{"$f":"IF(B445=\"\",\"\",COUNTIF('Incident Log'!$C$11:$C$500,B445))","v":""},{"$f":"IF(B445=\"\",\"\",RANK(C445,$C$11:$C$500)+COUNTIF($C$11:C445,C445)-1)","v":""},"","",""]
[{"$f":"IF('Incident Log'!C446=\"\",\"\",'Incident Log'!C446)","v":""},{"$f":"IFERROR(INDEX($A$11:$A$500, MATCH(0, COUNTIF($B$10:B445, $A$11:$A$500), 0)),\"\")","v":""},{"$f":"IF(B446=\"\",\"\",COUNTIF('Incident Log'!$C$11:$C$500,B446))","v":""},{"$f":"IF(B446=\"\",\"\",RANK(C446,$C$11:$C$500)+COUNTIF($C$11:C446,C446)-1)","v":""},"","",""]
[{"$f":"IF('Incident Log'!C447=\"\",\"\",'Incident Log'!C447)","v":""},{"$f":"IFERROR(INDEX($A$11:$A$500, MATCH(0, COUNTIF($B$10:B446, $A$11:$A$500), 0)),\"\")","v":""},{"$f":"IF(B447=\"\",\"\",COUNTIF('Incident Log'!$C$11:$C$500,B447))","v":""},{"$f":"IF(B447=\"\",\"\",RANK(C447,$C$11:$C$500)+COUNTIF($C$11:C447,C447)-1)","v":""},"","",""]
[{"$f":"IF('Incident Log'!C448=\"\",\"\",'Incident Log'!C448)","v":""},{"$f":"IFERROR(INDEX($A$11:$A$500, MATCH(0, COUNTIF($B$10:B447, $A$11:$A$500), 0)),\"\")","v":""},{"$f":"IF(B448=\"\",\"\",COUNTIF('Incident Log'!$C$11:$C$500,B448))","v":""},{"$f":"IF(B448=\"\",\"\",RANK(C448,$C$11:$C$500)+COUNTIF($C$11:C448,C448)-1)","v":""},"","",""]
[{"$f":"IF('Incident Log'!C449=\"\",\"\",'Incident Log'!C449)","v":""},{"$f":"IFERROR(INDEX($A$11:$A$500, MATCH(0, COUNTIF($B$10:B448, $A$11:$A$500), 0)),\"\")","v":""},{"$f":"IF(B449=\"\",\"\",COUNTIF('Incident Log'!$C$11:$C$500,B449))","v":""},{"$f":"IF(B449=\"\",\"\",RANK(C449,$C$11:$C$500)+COUNTIF($C$11:C449,C449)-1)","v":""},"","",""]
[{"$f":"IF('Incident Log'!C450=\"\",\"\",'Incident Log'!C450)","v":""},{"$f":"IFERROR(INDEX($A$11:$A$500, MATCH(0, COUNTIF($B$10:B449, $A$11:$A$500), 0)),\"\")","v":""},{"$f":"IF(B450=\"\",\"\",COUNTIF('Incident Log'!$C$11:$C$500,B450))","v":""},{"$f":"IF(B450=\"\",\"\",RANK(C450,$C$11:$C$500)+COUNTIF($C$11:C450,C450)-1)","v":""},"","",""]
[{"$f":"IF('Incident Log'!C451=\"\",\"\",'Incident Log'!C451)","v":""},{"$f":"IFERROR(INDEX($A$11:$A$500, MATCH(0, COUNTIF($B$10:B450, $A$11:$A$500), 0)),\"\")","v":""},{"$f":"IF(B451=\"\",\"\",COUNTIF('Incident Log'!$C$11:$C$500,B451))","v":""},{"$f":"IF(B451=\"\",\"\",RANK(C451,$C$11:$C$500)+COUNTIF($C$11:C451,C451)-1)","v":""},"","",""]
[{"$f":"IF('Incident Log'!C452=\"\",\"\",'Incident Log'!C452)","v":""},{"$f":"IFERROR(INDEX($A$11:$A$500, MATCH(0, COUNTIF($B$10:B451, $A$11:$A$500), 0)),\"\")","v":""},{"$f":"IF(B452=\"\",\"\",COUNTIF('Incident Log'!$C$11:$C$500,B452))","v":""},{"$f":"IF(B452=\"\",\"\",RANK(C452,$C$11:$C$500)+COUNTIF($C$11:C452,C452)-1)","v":""},"","",""]
[{"$f":"IF('Incident Log'!C453=\"\",\"\",'Incident Log'!C453)","v":""},{"$f":"IFERROR(INDEX($A$11:$A$500, MATCH(0, COUNTIF($B$10:B452, $A$11:$A$500), 0)),\"\")","v":""},{"$f":"IF(B453=\"\",\"\",COUNTIF('Incident Log'!$C$11:$C$500,B453))","v":""},{"$f":"IF(B453=\"\",\"\",RANK(C453,$C$11:$C$500)+COUNTIF($C$11:C453,C453)-1)","v":""},"","",""]
[{"$f":"IF('Incident Log'!C454=\"\",\"\",'Incident Log'!C454)","v":""},{"$f":"IFERROR(INDEX($A$11:$A$500, MATCH(0, COUNTIF($B$10:B453, $A$11:$A$500), 0)),\"\")","v":""},{"$f":"IF(B454=\"\",\"\",COUNTIF('Incident Log'!$C$11:$C$500,B454))","v":""},{"$f":"IF(B454=\"\",\"\",RANK(C454,$C$11:$C$500)+COUNTIF($C$11:C454,C454)-1)","v":""},"","",""]
[{"$f":"IF('Incident Log'!C455=\"\",\"\",'Incident Log'!C455)","v":""},{"$f":"IFERROR(INDEX($A$11:$A$500, MATCH(0, COUNTIF($B$10:B454, $A$11:$A$500), 0)),\"\")","v":""},{"$f":"IF(B455=\"\",\"\",COUNTIF('Incident Log'!$C$11:$C$500,B455))","v":""},{"$f":"IF(B455=\"\",\"\",RANK(C455,$C$11:$C$500)+COUNTIF($C$11:C455,C455)-1)","v":""},"","",""]
[{"$f":"IF('Incident Log'!C456=\"\",\"\",'Incident Log'!C456)","v":""},{"$f":"IFERROR(INDEX($A$11:$A$500, MATCH(0, COUNTIF($B$10:B455, $A$11:$A$500), 0)),\"\")","v":""},{"$f":"IF(B456=\"\",\"\",COUNTIF('Incident Log'!$C$11:$C$500,B456))","v":""},{"$f":"IF(B456=\"\",\"\",RANK(C456,$C$11:$C$500)+COUNTIF($C$11:C456,C456)-1)","v":""},"","",""]
[{"$f":"IF('Incident Log'!C457=\"\",\"\",'Incident Log'!C457)","v":""},{"$f":"IFERROR(INDEX($A$11:$A$500, MATCH(0, COUNTIF($B$10:B456, $A$11:$A$500), 0)),\"\")","v":""},{"$f":"IF(B457=\"\",\"\",COUNTIF('Incident Log'!$C$11:$C$500,B457))","v":""},{"$f":"IF(B457=\"\",\"\",RANK(C457,$C$11:$C$500)+COUNTIF($C$11:C457,C457)-1)","v":""},"","",""]
[{"$f":"IF('Incident Log'!C458=\"\",\"\",'Incident Log'!C458)","v":""},{"$f":"IFERROR(INDEX($A$11:$A$500, MATCH(0, COUNTIF($B$10:B457, $A$11:$A$500), 0)),\"\")","v":""},{"$f":"IF(B458=\"\",\"\",COUNTIF('Incident Log'!$C$11:$C$500,B458))","v":""},{"$f":"IF(B458=\"\",\"\",RANK(C458,$C$11:$C$500)+COUNTIF($C$11:C458,C458)-1)","v":""},"","",""]
[{"$f":"IF('Incident Log'!C459=\"\",\"\",'Incident Log'!C459)","v":""},{"$f":"IFERROR(INDEX($A$11:$A$500, MATCH(0, COUNTIF($B$10:B458, $A$11:$A$500), 0)),\"\")","v":""},{"$f":"IF(B459=\"\",\"\",COUNTIF('Incident Log'!$C$11:$C$500,B459))","v":""},{"$f":"IF(B459=\"\",\"\",RANK(C459,$C$11:$C$500)+COUNTIF($C$11:C459,C459)-1)","v":""},"","",""]
[{"$f":"IF('Incident Log'!C460=\"\",\"\",'Incident Log'!C460)","v":""},{"$f":"IFERROR(INDEX($A$11:$A$500, MATCH(0, COUNTIF($B$10:B459, $A$11:$A$500), 0)),\"\")","v":""},{"$f":"IF(B460=\"\",\"\",COUNTIF('Incident Log'!$C$11:$C$500,B460))","v":""},{"$f":"IF(B460=\"\",\"\",RANK(C460,$C$11:$C$500)+COUNTIF($C$11:C460,C460)-1)","v":""},"",{"$f":"IF(B460=\"\",\"\",INDEX($B$11:$B$500,MATCH(E460,$D$11:$D$500,0)))","v":""},{"$f":"IF(B460=\"\",\"\",VLOOKUP(F460,$B$11:$C$500,2,FALSE))","v":""}]
[{"$f":"IF('Incident Log'!C461=\"\",\"\",'Incident Log'!C461)","v":""},{"$f":"IFERROR(INDEX($A$11:$A$500, MATCH(0, COUNTIF($B$10:B460, $A$11:$A$500), 0)),\"\")","v":""},{"$f":"IF(B461=\"\",\"\",COUNTIF('Incident Log'!$C$11:$C$500,B461))","v":""},{"$f":"IF(B461=\"\",\"\",RANK(C461,$C$11:$C$500)+COUNTIF($C$11:C461,C461)-1)","v":""},"","",""]
[{"$f":"IF('Incident Log'!C462=\"\",\"\",'Incident Log'!C462)","v":""},{"$f":"IFERROR(INDEX($A$11:$A$500, MATCH(0, COUNTIF($B$10:B461, $A$11:$A$500), 0)),\"\")","v":""},{"$f":"IF(B462=\"\",\"\",COUNTIF('Incident Log'!$C$11:$C$500,B462))","v":""},{"$f":"IF(B462=\"\",\"\",RANK(C462,$C$11:$C$500)+COUNTIF($C$11:C462,C462)-1)","v":""},{"$f":"IF(B462=\"\",\"\",1+E461)","v":""},"",""]
[{"$f":"IF('Incident Log'!C463=\"\",\"\",'Incident Log'!C463)","v":""},{"$f":"IFERROR(INDEX($A$11:$A$500, MATCH(0, COUNTIF($B$10:B462, $A$11:$A$500), 0)),\"\")","v":""},{"$f":"IF(B463=\"\",\"\",COUNTIF('Incident Log'!$C$11:$C$500,B463))","v":""},{"$f":"IF(B463=\"\",\"\",RANK(C463,$C$11:$C$500)+COUNTIF($C$11:C463,C463)-1)","v":""},"","",""]
[{"$f":"IF('Incident Log'!C464=\"\",\"\",'Incident Log'!C464)","v":""},{"$f":"IFERROR(INDEX($A$11:$A$500, MATCH(0, COUNTIF($B$10:B463, $A$11:$A$500), 0)),\"\")","v":""},{"$f":"IF(B464=\"\",\"\",COUNTIF('Incident Log'!$C$11:$C$500,B464))","v":""},{"$f":"IF(B464=\"\",\"\",RANK(C464,$C$11:$C$500)+COUNTIF($C$11:C464,C464)-1)","v":""},"","",""]
[{"$f":"IF('Incident Log'!C465=\"\",\"\",'Incident Log'!C465)","v":""},{"$f":"IFERROR(INDEX($A$11:$A$500, MATCH(0, COUNTIF($B$10:B464, $A$11:$A$500), 0)),\"\")","v":""},{"$f":"IF(B465=\"\",\"\",COUNTIF('Incident Log'!$C$11:$C$500,B465))","v":""},{"$f":"IF(B465=\"\",\"\",RANK(C465,$C$11:$C$500)+COUNTIF($C$11:C465,C465)-1)","v":""},"","",""]
[{"$f":"IF('Incident Log'!C466=\"\",\"\",'Incident Log'!C466)","v":""},{"$f":"IFERROR(INDEX($A$11:$A$500, MATCH(0, COUNTIF($B$10:B465, $A$11:$A$500), 0)),\"\")","v":""},{"$f":"IF(B466=\"\",\"\",COUNTIF('Incident Log'!$C$11:$C$500,B466))","v":""},{"$f":"IF(B466=\"\",\"\",RANK(C466,$C$11:$C$500)+COUNTIF($C$11:C466,C466)-1)","v":""},"","",""]
[{"$f":"IF('Incident Log'!C467=\"\",\"\",'Incident Log'!C467)","v":""},{"$f":"IFERROR(INDEX($A$11:$A$500, MATCH(0, COUNTIF($B$10:B466, $A$11:$A$500), 0)),\"\")","v":""},{"$f":"IF(B467=\"\",\"\",COUNTIF('Incident Log'!$C$11:$C$500,B467))","v":""},{"$f":"IF(B467=\"\",\"\",RANK(C467,$C$11:$C$500)+COUNTIF($C$11:C467,C467)-1)","v":""},"","",""]
[{"$f":"IF('Incident Log'!C468=\"\",\"\",'Incident Log'!C468)","v":""},{"$f":"IFERROR(INDEX($A$11:$A$500, MATCH(0, COUNTIF($B$10:B467, $A$11:$A$500), 0)),\"\")","v":""},{"$f":"IF(B468=\"\",\"\",COUNTIF('Incident Log'!$C$11:$C$500,B468))","v":""},{"$f":"IF(B468=\"\",\"\",RANK(C468,$C$11:$C$500)+COUNTIF($C$11:C468,C468)-1)","v":""},"","",""]
[{"$f":"IF('Incident Log'!C469=\"\",\"\",'Incident Log'!C469)","v":""},{"$f":"IFERROR(INDEX($A$11:$A$500, MATCH(0, COUNTIF($B$10:B468, $A$11:$A$500), 0)),\"\")","v":""},{"$f":"IF(B469=\"\",\"\",COUNTIF('Incident Log'!$C$11:$C$500,B469))","v":""},{"$f":"IF(B469=\"\",\"\",RANK(C469,$C$11:$C$500)+COUNTIF($C$11:C469,C469)-1)","v":""},"","",""]
[{"$f":"IF('Incident Log'!C470=\"\",\"\",'Incident Log'!C470)","v":""},{"$f":"IFERROR(INDEX($A$11:$A$500, MATCH(0, COUNTIF($B$10:B469, $A$11:$A$500), 0)),\"\")","v":""},{"$f":"IF(B470=\"\",\"\",COUNTIF('Incident Log'!$C$11:$C$500,B470))","v":""},{"$f":"IF(B470=\"\",\"\",RANK(C470,$C$11:$C$500)+COUNTIF($C$11:C470,C470)-1)","v":""},"","",""]
[{"$f":"IF('Incident Log'!C471=\"\",\"\",'Incident Log'!C471)","v":""},{"$f":"IFERROR(INDEX($A$11:$A$500, MATCH(0, COUNTIF($B$10:B470, $A$11:$A$500), 0)),\"\")","v":""},{"$f":"IF(B471=\"\",\"\",COUNTIF('Incident Log'!$C$11:$C$500,B471))","v":""},{"$f":"IF(B471=\"\",\"\",RANK(C471,$C$11:$C$500)+COUNTIF($C$11:C471,C471)-1)","v":""},"","",""]
[{"$f":"IF('Incident Log'!C472=\"\",\"\",'Incident Log'!C472)","v":""},{"$f":"IFERROR(INDEX($A$11:$A$500, MATCH(0, COUNTIF($B$10:B471, $A$11:$A$500), 0)),\"\")","v":""},{"$f":"IF(B472=\"\",\"\",COUNTIF('Incident Log'!$C$11:$C$500,B472))","v":""},{"$f":"IF(B472=\"\",\"\",RANK(C472,$C$11:$C$500)+COUNTIF($C$11:C472,C472)-1)","v":""},"","",""]
[{"$f":"IF('Incident Log'!C473=\"\",\"\",'Incident Log'!C473)","v":""},{"$f":"IFERROR(INDEX($A$11:$A$500, MATCH(0, COUNTIF($B$10:B472, $A$11:$A$500), 0)),\"\")","v":""},{"$f":"IF(B473=\"\",\"\",COUNTIF('Incident Log'!$C$11:$C$500,B473))","v":""},{"$f":"IF(B473=\"\",\"\",RANK(C473,$C$11:$C$500)+COUNTIF($C$11:C473,C473)-1)","v":""},"","",""]
[{"$f":"IF('Incident Log'!C474=\"\",\"\",'Incident Log'!C474)","v":""},{"$f":"IFERROR(INDEX($A$11:$A$500, MATCH(0, COUNTIF($B$10:B473, $A$11:$A$500), 0)),\"\")","v":""},{"$f":"IF(B474=\"\",\"\",COUNTIF('Incident Log'!$C$11:$C$500,B474))","v":""},{"$f":"IF(B474=\"\",\"\",RANK(C474,$C$11:$C$500)+COUNTIF($C$11:C474,C474)-1)","v":""},"","",""]
[{"$f":"IF('Incident Log'!C475=\"\",\"\",'Incident Log'!C475)","v":""},{"$f":"IFERROR(INDEX($A$11:$A$500, MATCH(0, COUNTIF($B$10:B474, $A$11:$A$500), 0)),\"\")","v":""},{"$f":"IF(B475=\"\",\"\",COUNTIF('Incident Log'!$C$11:$C$500,B475))","v":""},{"$f":"IF(B475=\"\",\"\",RANK(C475,$C$11:$C$500)+COUNTIF($C$11:C475,C475)-1)","v":""},"","",""]
[{"$f":"IF('Incident Log'!C476=\"\",\"\",'Incident Log'!C476)","v":""},{"$f":"IFERROR(INDEX($A$11:$A$500, MATCH(0, COUNTIF($B$10:B475, $A$11:$A$500), 0)),\"\")","v":""},{"$f":"IF(B476=\"\",\"\",COUNTIF('Incident Log'!$C$11:$C$500,B476))","v":""},{"$f":"IF(B476=\"\",\"\",RANK(C476,$C$11:$C$500)+COUNTIF($C$11:C476,C476)-1)","v":""},"","",""]
[{"$f":"IF('Incident Log'!C477=\"\",\"\",'Incident Log'!C477)","v":""},{"$f":"IFERROR(INDEX($A$11:$A$500, MATCH(0, COUNTIF($B$10:B476, $A$11:$A$500), 0)),\"\")","v":""},{"$f":"IF(B477=\"\",\"\",COUNTIF('Incident Log'!$C$11:$C$500,B477))","v":""},{"$f":"IF(B477=\"\",\"\",RANK(C477,$C$11:$C$500)+COUNTIF($C$11:C477,C477)-1)","v":""},"","",""]
[{"$f":"IF('Incident Log'!C478=\"\",\"\",'Incident Log'!C478)","v":""},{"$f":"IFERROR(INDEX($A$11:$A$500, MATCH(0, COUNTIF($B$10:B477, $A$11:$A$500), 0)),\"\")","v":""},{"$f":"IF(B478=\"\",\"\",COUNTIF('Incident Log'!$C$11:$C$500,B478))","v":""},{"$f":"IF(B478=\"\",\"\",RANK(C478,$C$11:$C$500)+COUNTIF($C$11:C478,C478)-1)","v":""},"","",""]
[{"$f":"IF('Incident Log'!C479=\"\",\"\",'Incident Log'!C479)","v":""},{"$f":"IFERROR(INDEX($A$11:$A$500, MATCH(0, COUNTIF($B$10:B478, $A$11:$A$500), 0)),\"\")","v":""},{"$f":"IF(B479=\"\",\"\",COUNTIF('Incident Log'!$C$11:$C$500,B479))","v":""},{"$f":"IF(B479=\"\",\"\",RANK(C479,$C$11:$C$500)+COUNTIF($C$11:C479,C479)-1)","v":""},"","",""]
[{"$f":"IF('Incident Log'!C480=\"\",\"\",'Incident Log'!C480)","v":""},{"$f":"IFERROR(INDEX($A$11:$A$500, MATCH(0, COUNTIF($B$10:B479, $A$11:$A$500), 0)),\"\")","v":""},{"$f":"IF(B480=\"\",\"\",COUNTIF('Incident Log'!$C$11:$C$500,B480))","v":""},{"$f":"IF(B480=\"\",\"\",RANK(C480,$C$11:$C$500)+COUNTIF($C$11:C480,C480)-1)","v":""},"","",""]
[{"$f":"IF('Incident Log'!C481=\"\",\"\",'Incident Log'!C481)","v":""},{"$f":"IFERROR(INDEX($A$11:$A$500, MATCH(0, COUNTIF($B$10:B480, $A$11:$A$500), 0)),\"\")","v":""},{"$f":"IF(B481=\"\",\"\",COUNTIF('Incident Log'!$C$11:$C$500,B481))","v":""},{"$f":"IF(B481=\"\",\"\",RANK(C481,$C$11:$C$500)+COUNTIF($C$11:C481,C481)-1)","v":""},"","",""]
[{"$f":"IF('Incident Log'!C482=\"\",\"\",'Incident Log'!C482)","v":""},{"$f":"IFERROR(INDEX($A$11:$A$500, MATCH(0, COUNTIF($B$10:B481, $A$11:$A$500), 0)),\"\")","v":""},{"$f":"IF(B482=\"\",\"\",COUNTIF('Incident Log'!$C$11:$C$500,B482))","v":""},{"$f":"IF(B482=\"\",\"\",RANK(C482,$C$11:$C$500)+COUNTIF($C$11:C482,C482)-1)","v":""},"","",""]
[{"$f":"IF('Incident Log'!C483=\"\",\"\",'Incident Log'!C483)","v":""},{"$f":"IFERROR(INDEX($A$11:$A$500, MATCH(0, COUNTIF($B$10:B482, $A$11:$A$500), 0)),\"\")","v":""},{"$f":"IF(B483=\"\",\"\",COUNTIF('Incident Log'!$C$11:$C$500,B483))","v":""},{"$f":"IF(B483=\"\",\"\",RANK(C483,$C$11:$C$500)+COUNTIF($C$11:C483,C483)-1)","v":""},"","",""]
[{"$f":"IF('Incident Log'!C484=\"\",\"\",'Incident Log'!C484)","v":""},{"$f":"IFERROR(INDEX($A$11:$A$500, MATCH(0, COUNTIF($B$10:B483, $A$11:$A$500), 0)),\"\")","v":""},{"$f":"IF(B484=\"\",\"\",COUNTIF('Incident Log'!$C$11:$C$500,B484))","v":""},{"$f":"IF(B484=\"\",\"\",RANK(C484,$C$11:$C$500)+COUNTIF($C$11:C484,C484)-1)","v":""},"","",""]
[{"$f":"IF('Incident Log'!C485=\"\",\"\",'Incident Log'!C485)","v":""},{"$f":"IFERROR(INDEX($A$11:$A$500, MATCH(0, COUNTIF($B$10:B484, $A$11:$A$500), 0)),\"\")","v":""},{"$f":"IF(B485=\"\",\"\",COUNTIF('Incident Log'!$C$11:$C$500,B485))","v":""},{"$f":"IF(B485=\"\",\"\",RANK(C485,$C$11:$C$500)+COUNTIF($C$11:C485,C485)-1)","v":""},"","",""]
[{"$f":"IF('Incident Log'!C486=\"\",\"\",'Incident Log'!C486)","v":""},{"$f":"IFERROR(INDEX($A$11:$A$500, MATCH(0, COUNTIF($B$10:B485, $A$11:$A$500), 0)),\"\")","v":""},{"$f":"IF(B486=\"\",\"\",COUNTIF('Incident Log'!$C$11:$C$500,B486))","v":""},{"$f":"IF(B486=\"\",\"\",RANK(C486,$C$11:$C$500)+COUNTIF($C$11:C486,C486)-1)","v":""},"","",""]
[{"$f":"IF('Incident Log'!C487=\"\",\"\",'Incident Log'!C487)","v":""},{"$f":"IFERROR(INDEX($A$11:$A$500, MATCH(0, COUNTIF($B$10:B486, $A$11:$A$500), 0)),\"\")","v":""},{"$f":"IF(B487=\"\",\"\",COUNTIF('Incident Log'!$C$11:$C$500,B487))","v":""},{"$f":"IF(B487=\"\",\"\",RANK(C487,$C$11:$C$500)+COUNTIF($C$11:C487,C487)-1)","v":""},"","",""]
[{"$f":"IF('Incident Log'!C488=\"\",\"\",'Incident Log'!C488)","v":""},{"$f":"IFERROR(INDEX($A$11:$A$500, MATCH(0, COUNTIF($B$10:B487, $A$11:$A$500), 0)),\"\")","v":""},{"$f":"IF(B488=\"\",\"\",COUNTIF('Incident Log'!$C$11:$C$500,B488))","v":""},{"$f":"IF(B488=\"\",\"\",RANK(C488,$C$11:$C$500)+COUNTIF($C$11:C488,C488)-1)","v":""},"","",""]
[{"$f":"IF('Incident Log'!C489=\"\",\"\",'Incident Log'!C489)","v":""},{"$f":"IFERROR(INDEX($A$11:$A$500, MATCH(0, COUNTIF($B$10:B488, $A$11:$A$500), 0)),\"\")","v":""},{"$f":"IF(B489=\"\",\"\",COUNTIF('Incident Log'!$C$11:$C$500,B489))","v":""},{"$f":"IF(B489=\"\",\"\",RANK(C489,$C$11:$C$500)+COUNTIF($C$11:C489,C489)-1)","v":""},"","",""]
[{"$f":"IF('Incident Log'!C490=\"\",\"\",'Incident Log'!C490)","v":""},{"$f":"IFERROR(INDEX($A$11:$A$500, MATCH(0, COUNTIF($B$10:B489, $A$11:$A$500), 0)),\"\")","v":""},{"$f":"IF(B490=\"\",\"\",COUNTIF('Incident Log'!$C$11:$C$500,B490))","v":""},{"$f":"IF(B490=\"\",\"\",RANK(C490,$C$11:$C$500)+COUNTIF($C$11:C490,C490)-1)","v":""},"","",""]
[{"$f":"IF('Incident Log'!C491=\"\",\"\",'Incident Log'!C491)","v":""},{"$f":"IFERROR(INDEX($A$11:$A$500, MATCH(0, COUNTIF($B$10:B490, $A$11:$A$500), 0)),\"\")","v":""},{"$f":"IF(B491=\"\",\"\",COUNTIF('Incident Log'!$C$11:$C$500,B491))","v":""},{"$f":"IF(B491=\"\",\"\",RANK(C491,$C$11:$C$500)+COUNTIF($C$11:C491,C491)-1)","v":""},"","",""]
[{"$f":"IF('Incident Log'!C492=\"\",\"\",'Incident Log'!C492)","v":""},{"$f":"IFERROR(INDEX($A$11:$A$500, MATCH(0, COUNTIF($B$10:B491, $A$11:$A$500), 0)),\"\")","v":""},{"$f":"IF(B492=\"\",\"\",COUNTIF('Incident Log'!$C$11:$C$500,B492))","v":""},{"$f":"IF(B492=\"\",\"\",RANK(C492,$C$11:$C$500)+COUNTIF($C$11:C492,C492)-1)","v":""},"","",""]
[{"$f":"IF('Incident Log'!C493=\"\",\"\",'Incident Log'!C493)","v":""},{"$f":"IFERROR(INDEX($A$11:$A$500, MATCH(0, COUNTIF($B$10:B492, $A$11:$A$500), 0)),\"\")","v":""},{"$f":"IF(B493=\"\",\"\",COUNTIF('Incident Log'!$C$11:$C$500,B493))","v":""},{"$f":"IF(B493=\"\",\"\",RANK(C493,$C$11:$C$500)+COUNTIF($C$11:C493,C493)-1)","v":""},"","",""]
[{"$f":"IF('Incident Log'!C494=\"\",\"\",'Incident Log'!C494)","v":""},{"$f":"IFERROR(INDEX($A$11:$A$500, MATCH(0, COUNTIF($B$10:B493, $A$11:$A$500), 0)),\"\")","v":""},{"$f":"IF(B494=\"\",\"\",COUNTIF('Incident Log'!$C$11:$C$500,B494))","v":""},{"$f":"IF(B494=\"\",\"\",RANK(C494,$C$11:$C$500)+COUNTIF($C$11:C494,C494)-1)","v":""},"","",""]
[{"$f":"IF('Incident Log'!C495=\"\",\"\",'Incident Log'!C495)","v":""},{"$f":"IFERROR(INDEX($A$11:$A$500, MATCH(0, COUNTIF($B$10:B494, $A$11:$A$500), 0)),\"\")","v":""},{"$f":"IF(B495=\"\",\"\",COUNTIF('Incident Log'!$C$11:$C$500,B495))","v":""},{"$f":"IF(B495=\"\",\"\",RANK(C495,$C$11:$C$500)+COUNTIF($C$11:C495,C495)-1)","v":""},"","",""]
[{"$f":"IF('Incident Log'!C496=\"\",\"\",'Incident Log'!C496)","v":""},{"$f":"IFERROR(INDEX($A$11:$A$500, MATCH(0, COUNTIF($B$10:B495, $A$11:$A$500), 0)),\"\")","v":""},{"$f":"IF(B496=\"\",\"\",COUNTIF('Incident Log'!$C$11:$C$500,B496))","v":""},{"$f":"IF(B496=\"\",\"\",RANK(C496,$C$11:$C$500)+COUNTIF($C$11:C496,C496)-1)","v":""},"","",""]
[{"$f":"IF('Incident Log'!C497=\"\",\"\",'Incident Log'!C497)","v":""},{"$f":"IFERROR(INDEX($A$11:$A$500, MATCH(0, COUNTIF($B$10:B496, $A$11:$A$500), 0)),\"\")","v":""},{"$f":"IF(B497=\"\",\"\",COUNTIF('Incident Log'!$C$11:$C$500,B497))","v":""},{"$f":"IF(B497=\"\",\"\",RANK(C497,$C$11:$C$500)+COUNTIF($C$11:C497,C497)-1)","v":""},"","",""]
[{"$f":"IF('Incident Log'!C498=\"\",\"\",'Incident Log'!C498)","v":""},{"$f":"IFERROR(INDEX($A$11:$A$500, MATCH(0, COUNTIF($B$10:B497, $A$11:$A$500), 0)),\"\")","v":""},{"$f":"IF(B498=\"\",\"\",COUNTIF('Incident Log'!$C$11:$C$500,B498))","v":""},{"$f":"IF(B498=\"\",\"\",RANK(C498,$C$11:$C$500)+COUNTIF($C$11:C498,C498)-1)","v":""},"","",""]
[{"$f":"IF('Incident Log'!C499=\"\",\"\",'Incident Log'!C499)","v":""},{"$f":"IFERROR(INDEX($A$11:$A$500, MATCH(0, COUNTIF($B$10:B498, $A$11:$A$500), 0)),\"\")","v":""},{"$f":"IF(B499=\"\",\"\",COUNTIF('Incident Log'!$C$11:$C$500,B499))","v":""},{"$f":"IF(B499=\"\",\"\",RANK(C499,$C$11:$C$500)+COUNTIF($C$11:C499,C499)-1)","v":""},"","",""]
[{"$f":"IF('Incident Log'!C500=\"\",\"\",'Incident Log'!C500)","v":""},{"$f":"IFERROR(INDEX($A$11:$A$500, MATCH(0, COUNTIF($B$10:B499, $A$11:$A$500), 0)),\"\")","v":""},{"$f":"IF(B500=\"\",\"\",COUNTIF('Incident Log'!$C$11:$C$500,B500))","v":""},{"$f":"IF(B500=\"\",\"\",RANK(C500,$C$11:$C$500)+COUNTIF($C$11:C500,C500)-1)","v":""},"","",""]

{"sheet":"Reference","index":7,"n_rows":70,"n_cols":6,"rows_kept":70,"cut":false,"hidden":true,"merged":[]}
[]
[]
[]
[]
[]
[{"$f":"\"Reference - \"&Input!B14","v":"Reference - SITE & ADDRESS"}]
[]
["Alert Type","Notification Method","Yes/No","Alert Category","Internal/External","Hazard Score"]
["Active Shooter","Direct Call","Yes","Hazmat","Internal",0]
["Act of Terrorism","Email","No","Human","External",1]
["Air Quality Issue","In Person","Not Sure","Natural","Both",2]
["Bomb Threat","News / Media","Unknown","Technological","Other",3]
["Building Move","Radio",null,"Other"]
["Chemical Exposure, External","Other Source"]
["Chemical Exposure, Internal","Text"]
["Chemical Spill","Word of Mouth"]
["Chemical Spill, Large"]
["Child Abduction"]
["Civil Unrest / Protesting"]
["Communication / Telephony Failure"]
["Dam Failure"]
["Drought"]
["Earthquake"]
["Epidemic"]
["Evacuation"]
["Explosion"]
["Fire, External"]
["Fire, Internal"]
["Flood, External"]
["Flood, Internal"]
["Forensic Admission"]
["Gas / Emmissions Leak"]
["Generator Failure"]
["Hostage Situation"]
["Hurricane"]
["HVAC Failure"]
["Inclement Weather"]
["Infectious Disease Outbreak"]
["IT System Outage"]
["Landslide"]
["Mass Casualty Incident - Hazmat"]
["Mass Casualty Incident - Medical"]
["Mass Casualty Incident - Trauma"]
["Medical Gas Disruption"]
["Natural Gas Disruption"]
["Pandemic"]
["Patient Elopement"]
["Patient Surge"]
["Picketing"]
["Planned Power Outage"]
["Power Outage"]
["Radiation Exposure"]
["Seasonal Influenza"]
["Sewage Failure"]
["Shelter in Place"]
["Strikes / Labor Action /  Work Stoppage"]
["Suicide"]
["Supply Chain Shortage / Failure"]
["Suspicious Package / Substance"]
["Temperature Extremes"]
["Tornado"]
["Transportation Failure"]
["Trauma"]
["Tsunami"]
["Utility Failure"]
["VIP Situation"]
["Water Contamination"]
["Water Disruption"]
["Weapon"]
["Workplace Violence / Threat"]

{"sheet":"Template","index":8,"n_rows":6,"n_cols":1,"rows_kept":6,"cut":false,"hidden":true,"merged":[]}
[]
[]
[]
[]
[]
["Template"]