{"text_format":"1","workbook":"xlsx","n_sheets":9,"sheets":["Instructions","Input","HVA","Incident Log","Summary","Detail","Calculation","Reference","Template"],"not_rendered":{"charts":1,"images":1,"macros":1,"external_links":0,"defined_names":22,"comments":0,"pivot_tables":0},"unopened":[],"bounds":{"document_bytes":16777216,"sheet_cells":100000,"rows_first":2000,"rows_last":500,"rows_between":2000,"halvings":0,"cell_chars":16384,"cell_head_chars":4096},"cells_cut":0,"cells_raw":0,"read":"whole","date_system":"1900"}

{"sheet":"Instructions","index":0,"n_rows":30,"n_cols":10,"rows_kept":30,"cut":false,"hidden":false,"merged":[[9,9,9,14],[3,0,3,14],[0,0,0,14],[2,0,2,14],[4,0,4,6],[4,8,4,14],[5,1,5,6],[5,9,5,14],[1,0,1,14],[6,1,6,6],[6,9,6,14],[7,9,7,14],[8,0,8,6],[8,9,8,14]]}
[]
["INSTRUCTIONS FOR COMPLETING THE HAZARD VULNERABILITY ANALYSIS (HVA)"]
["This HVA tool is a living document.  Facilities using the tool shall complete it as it pertains to their facility / building. \n1) Following this tab listing Instructions for the completion of the HVA, is a tab listed as Input. \n     a) List the year when this HVA is being completed in Cell B11.  The template will indicate: \"YEAR\" in B11\n     b) List the facility name and address next to \"Report For\" in Cell B14.  The template will indicate: \"SITE & ADDRESS\" in B14\n     c) Information entered into the Input tab will be directly populated into the HVA under the HVA tab.\n2) The HVA tab contains various \"Alert Type\".  Review them and assign each with Probability Rating between 0 -3.  Review the information in the section below titled: Considerations for Completing the HVA.  Other factors are to consider each event incident occuring at the worst possible time (i.e. during peak patient loads, etc.).\n    a) Do not enter a value for each \"Alert Type\" under the columns titled: \"Alerts\" and \"Activations\".  These are self populated cells.\n    b) Review the considerations in the table below and assign each \"Alert Typle\" in the HVA with a rating for HUMAN, PROPERTY and BUSINESS IMPACTS\n    c) Review the considerations in the table below and assign each \"Alert Typle\" in the HVA with a rating for PREPAREDNESS, INTERNAL and EXTERNAL RESPONSES\n    d) Once the values are entered a percentage value will be automatically assigned under the \"Risk\" column.  \n3) Once the \"Risk\" percentages are established, the facility must then identify its top 3 - 5 risks.  An Emergency Operations Plan focusing on: Mitigation, Preparedness, Response, and Recovery should be developed to focus on these vulnerabilities. \n4) As noted, this HVA tool is a living document. As they occur throughout the calendar year incidents that align with the \"Alert Type\" on the HVA should be cataloged on the sheet under the tab titled: \"Incident Log\". A number of the cells in each column provide the user options to choose a response, which are then tabulated on the HVA based on the incident.  If the Incident is deemed as \"Alerts\" or \"Activations\"  their tally will be captured and the HVA \"Risk\" percentage for that \"Alert Type\" will be recalculated.  \n5) The \"Summary\" captures and tabulates the events entered on the Incident Log tab, which aids in the development of the Annual Review write-up of the Emergency Management Plan."]
["CONSIDERATIONS FOR COMPLETING THE HVA"]
["PROBABILITY: Issues to consider include, but are not limited to:",null,null,null,null,null,null,null,"PREPAREDNESS: Issues to consider include, but are not limited to:"]
["Ø","Known Risk",null,null,null,null,null,null,"Ø","Status of current plans"]
["Ø","Historical Data (10 Year Time Frame)",null,null,null,null,null,null,"Ø","Frequency of drills"]
[null,null,null,null,null,null,null,null,"Ø","Training and implementation status"]
["HUMAN IMPACT: Issues to consider include, but are not limited to:",null,null,null,null,null,null,null,"Ø","Insurance"]
["Ø","Acuity and volume of injury/death to staff, patients, & visitors",null,null,null,null,null,null,"Ø","Availability of alternate sources for critical supplies/services"]
[]
["PROPERTY IMPACT: Issues to consider include, but are not limited to:",null,null,null,null,null,null,null,"INTERNAL RESPONSE: Issues to consider include, but are not limited to:"]
["Ø","Cost to replace",null,null,null,null,null,null,"Ø","Types of supplies on hand/will they meet need?"]
["Ø","Cost to set up temporary replacement",null,null,null,null,null,null,"Ø","Volume of supplies on hand/will they meet need?"]
["Ø","Cost to repair",null,null,null,null,null,null,"Ø","Staff availability"]
["Ø","Time to recover",null,null,null,null,null,null,"Ø","Coordination with Memorandums of Understanding"]
["Ø","Cost to repair/replace based on past incidents",null,null,null,null,null,null,"Ø","Availability of back-up systems"]
[null,null,null,null,null,null,null,null,"Ø","Internal resources ability to withstand disasters/survivability"]
["BUSINESS IMPACT: Issues to consider include, but are not limited to:"]
["Ø","Business interruption",null,null,null,null,null,null,"EXTERNAL RESPONSE: Issues to consider include, but are not limited to:"]
{"$rows_left_out":11}
{"sheet":"Input","index":1,"n_rows":17,"n_cols":2,"rows_kept":17,"cut":false,"hidden":false,"merged":[]}
[]
[]
[]
[]
[]
["Input"]
[]
[]
[]
[]
["Report Year","YEAR"]
["Last Saved","Tuesday, July 16, 2024 at 10:00 AM"]
[]
["Report For","SITE & ADDRESS"]
[]
["Max Score",5]
["Max Total Score",18]

{"sheet":"HVA","index":2,"n_rows":75,"n_cols":15,"rows_kept":75,"cut":false,"hidden":false,"merged":[[9,4,9,9],[9,0,11,0]]}
[]
[]
[]
[]
[]
[{"$f":"\"Hazards - \"&Input!B14","v":"Hazards - SITE & ADDRESS"}]
["Hazard Vulnerability Assessment Tool"]
[]
[]
["Alert Type"," ",null,null,"SEVERITY = ( MAGNITUDE - MITGATION )"]
[null,"PROBABILITY","ALERTS","ACTIVATIONS","HUMAN\nIMPACT","PROPERTY\nIMPACT","BUSINESS\nIMPACT","PREPARED-\nNESS","INTERNAL\nRESPONSE","EXTERNAL\nRESPONSE","RISK","MAX SCORE"]
[null,"Likelihood this will occur",null,null,"Possibility of dealth or injury","Physical losses and damages","Interuption of services","Preplanning","Time, effectiveness, resources","Community/Mutual Aid staff and supplies","* Relative threat"]
["SCORE","0 = N/A\n1 = Low\n2 = Moderate\n3 = High",{"$f":"\"Number of Alerts\"","v":"Number of Alerts"},{"$f":"\"Number of Activations\"","v":"Number of Activations"},"0 = N/A\n1 = Low\n2 = Moderate\n3 = High","0 = N/A\n1 = Low\n2 = Moderate\n3 = High","0 = N/A\n1 = Low\n2 = Moderate\n3 = High","0 = N/A\n1 = High\n2 = Moderate\n3 = Low","0 = N/A\n1 = High\n2 = Moderate\n3 = Low","0 = N/A\n1 =High\n2 = Moderate\n3 = Low","0 - 100%","Probability + 'Total Alerts + Total Activations",null,"Rank","Alert Type"]
[{"$f":"IF(Reference!A9=\"\",\"\",Reference!A9)","v":"Active Shooter"},null,{"$f":"IF(B14=\"\",\"\",COUNTIF('Incident Log'!$C$11:$C$500,A14))","v":""},{"$f":"IF(B14=\"\",\"\",COUNTIFS('Incident Log'!$C$11:$C$500,\"=\"&A14,'Incident Log'!$J$11:$J$500,\"=Yes\"))","v":""},null,null,null,null,null,null,{"$f":"IF(B14=\"\",\"\",ROUND(SUM(B14:D14)/L14*SUM(E14:J14)/MaxTotalScore,13))","v":""},{"$f":"IF(B14=\"\",\"\",SUM(C14:D14)+MaxScore)","v":""},null,{"$f":"IF(K14=\"\",\"\",RANK(K14,$K$14:$K$500)+COUNTIF(K14:$K$14,K14)-1)","v":""},{"$f":"A14","v":"Active Shooter"}]
[{"$f":"IF(Reference!A10=\"\",\"\",Reference!A10)","v":"Act of Terrorism"},null,{"$f":"IF(B15=\"\",\"\",COUNTIF('Incident Log'!$C$11:$C$500,A15))","v":""},{"$f":"IF(B15=\"\",\"\",COUNTIFS('Incident Log'!$C$11:$C$500,\"=\"&A15,'Incident Log'!$J$11:$J$500,\"=Yes\"))","v":""},null,null,null,null,null,null,"","",null,{"$f":"IF(K15=\"\",\"\",RANK(K15,$K$14:$K$500)+COUNTIF(K$14:$K15,K15)-1)","v":""},{"$f":"A15","v":"Act of Terrorism"}]
[{"$f":"IF(Reference!A11=\"\",\"\",Reference!A11)","v":"Air Quality Issue"},null,{"$f":"IF(B16=\"\",\"\",COUNTIF('Incident Log'!$C$11:$C$500,A16))","v":""},{"$f":"IF(B16=\"\",\"\",COUNTIFS('Incident Log'!$C$11:$C$500,\"=\"&A16,'Incident Log'!$J$11:$J$500,\"=Yes\"))","v":""},null,null,null,null,null,null,"","",null,{"$f":"IF(K16=\"\",\"\",RANK(K16,$K$14:$K$500)+COUNTIF(K$14:$K16,K16)-1)","v":""},"Air Quality Issue"]
[{"$f":"IF(Reference!A12=\"\",\"\",Reference!A12)","v":"Bomb Threat"},null,{"$f":"IF(B17=\"\",\"\",COUNTIF('Incident Log'!$C$11:$C$500,A17))","v":""},{"$f":"IF(B17=\"\",\"\",COUNTIFS('Incident Log'!$C$11:$C$500,\"=\"&A17,'Incident Log'!$J$11:$J$500,\"=Yes\"))","v":""},null,null,null,null,null,null,"","",null,{"$f":"IF(K17=\"\",\"\",RANK(K17,$K$14:$K$500)+COUNTIF(K$14:$K17,K17)-1)","v":""},"Bomb Threat"]
[{"$f":"IF(Reference!A13=\"\",\"\",Reference!A13)","v":"Building Move"},null,{"$f":"IF(B18=\"\",\"\",COUNTIF('Incident Log'!$C$11:$C$500,A18))","v":""},{"$f":"IF(B18=\"\",\"\",COUNTIFS('Incident Log'!$C$11:$C$500,\"=\"&A18,'Incident Log'!$J$11:$J$500,\"=Yes\"))","v":""},null,null,null,null,null,null,"","",null,{"$f":"IF(K18=\"\",\"\",RANK(K18,$K$14:$K$500)+COUNTIF(K$14:$K18,K18)-1)","v":""},"Building Move"]
[{"$f":"IF(Reference!A14=\"\",\"\",Reference!A14)","v":"Chemical Exposure, External"},null,{"$f":"IF(B19=\"\",\"\",COUNTIF('Incident Log'!$C$11:$C$500,A19))","v":""},{"$f":"IF(B19=\"\",\"\",COUNTIFS('Incident Log'!$C$11:$C$500,\"=\"&A19,'Incident Log'!$J$11:$J$500,\"=Yes\"))","v":""},null,null,null,null,null,null,"","",null,{"$f":"IF(K19=\"\",\"\",RANK(K19,$K$14:$K$500)+COUNTIF(K$14:$K19,K19)-1)","v":""},"Chemical Exposure, External"]
[{"$f":"IF(Reference!A15=\"\",\"\",Reference!A15)","v":"Chemical Exposure, Internal"},null,{"$f":"IF(B20=\"\",\"\",COUNTIF('Incident Log'!$C$11:$C$500,A20))","v":""},{"$f":"IF(B20=\"\",\"\",COUNTIFS('Incident Log'!$C$11:$C$500,\"=\"&A20,'Incident Log'!$J$11:$J$500,\"=Yes\"))","v":""},null,null,null,null,null,null,"","",null,{"$f":"IF(K20=\"\",\"\",RANK(K20,$K$14:$K$500)+COUNTIF(K$14:$K20,K20)-1)","v":""},"Chemical Exposure, Internal"]
{"$rows_left_out":56}
{"sheet":"Incident Log","index":3,"n_rows":10,"n_cols":18,"rows_kept":10,"cut":false,"hidden":false,"merged":[]}
[]
[]
[]
[]
[]
[{"$f":"\"Data - \"&Input!B14","v":"Data - SITE & ADDRESS"}]
[]
[]
[]
["Date","Alert Category","Alert Type","Internal / External","Responder","Location","Address","Notification Method","Point of Contact","Command Center Activation","Patient Care Impacts","Business / Operational Impacts","Structural Impacts","Resource Request","Recovery Plan Activated","AAR","End Date","Event Summary "]

{"sheet":"Summary","index":4,"n_rows":36,"n_cols":7,"rows_kept":36,"cut":false,"hidden":false,"merged":[]}
[]
[]
[]
[]
[]
[{"$f":"\"Summary For - \"&Input!B14","v":"Summary For - SITE & ADDRESS"}]
[]
[]
[]
["ALERT TYPE","OCCURRENCE"]
[{"$f":"'Incident Log'!J10","v":"Command Center Activation"},{"$f":"COUNTIF('Incident Log'!$J$11:$J$500,\"Yes\")","v":0}]
[{"$f":"'Incident Log'!K10","v":"Patient Care Impacts"},{"$f":"COUNTIF('Incident Log'!$K$11:$K$500,\"Yes\")","v":0}]
[{"$f":"'Incident Log'!L10","v":"Business / Operational Impacts"},{"$f":"COUNTIF('Incident Log'!$L$11:$L$500,\"Yes\")","v":0}]
[{"$f":"'Incident Log'!M10","v":"Structural Impacts"},{"$f":"COUNTIF('Incident Log'!$M$11:$M$500,\"Yes\")","v":0}]
[{"$f":"'Incident Log'!N10","v":"Resource Request"},{"$f":"COUNTIF('Incident Log'!$N$11:$N$500,\"Yes\")","v":0}]
[{"$f":"'Incident Log'!O10","v":"Recovery Plan Activated"},{"$f":"COUNTIF('Incident Log'!$O$11:$O$500,\"Yes\")","v":0}]
[{"$f":"'Incident Log'!P10","v":"AAR"},{"$f":"COUNTIF('Incident Log'!$P$11:$P$500,\"Yes\")","v":0}]
["Total Alert",{"$f":"COUNTA('Incident Log'!$C$11:$C$500)","v":0}]
[]
[]
{"$rows_left_out":17}
{"sheet":"Detail","index":5,"n_rows":50,"n_cols":2,"rows_kept":50,"cut":false,"hidden":true,"merged":[]}
[]
[]
[]
[]
[]
[{"$f":"\"Detail - \"&Input!B14","v":"Detail - SITE & ADDRESS"}]
[]
[]
["Alert Type","Actual Alert"]
[{"$f":"IF(Calculation!F11=\"\",\"\",Calculation!F11)","v":"Blank"},{"$f":"IF(Calculation!G11=\"\",\"\",Calculation!G11)","v":0}]
[{"$f":"IF(Calculation!F12=\"\",\"\",Calculation!F12)","v":""},{"$f":"IF(Calculation!G12=\"\",\"\",Calculation!G12)","v":""}]
[{"$f":"IF(Calculation!F13=\"\",\"\",Calculation!F13)","v":""},{"$f":"IF(Calculation!G13=\"\",\"\",Calculation!G13)","v":""}]
[{"$f":"IF(Calculation!F14=\"\",\"\",Calculation!F14)","v":""},{"$f":"IF(Calculation!G14=\"\",\"\",Calculation!G14)","v":""}]
[{"$f":"IF(Calculation!F15=\"\",\"\",Calculation!F15)","v":""},{"$f":"IF(Calculation!G15=\"\",\"\",Calculation!G15)","v":""}]
[{"$f":"IF(Calculation!F16=\"\",\"\",Calculation!F16)","v":""},{"$f":"IF(Calculation!G16=\"\",\"\",Calculation!G16)","v":""}]
[{"$f":"IF(Calculation!F17=\"\",\"\",Calculation!F17)","v":""},{"$f":"IF(Calculation!G17=\"\",\"\",Calculation!G17)","v":""}]
[{"$f":"IF(Calculation!F18=\"\",\"\",Calculation!F18)","v":""},{"$f":"IF(Calculation!G18=\"\",\"\",Calculation!G18)","v":""}]
[{"$f":"IF(Calculation!F19=\"\",\"\",Calculation!F19)","v":""},{"$f":"IF(Calculation!G19=\"\",\"\",Calculation!G19)","v":""}]
[{"$f":"IF(Calculation!F20=\"\",\"\",Calculation!F20)","v":""},{"$f":"IF(Calculation!G20=\"\",\"\",Calculation!G20)","v":""}]
[{"$f":"IF(Calculation!F21=\"\",\"\",Calculation!F21)","v":""},{"$f":"IF(Calculation!G21=\"\",\"\",Calculation!G21)","v":""}]
{"$rows_left_out":31}
{"sheet":"Calculation","index":6,"n_rows":500,"n_cols":7,"rows_kept":500,"cut":false,"hidden":true,"merged":[]}
[]
[]
[]
[]
[]
["Calculation"]
[]
[]
[]
[{"$f":"IF('Incident Log'!C10=\"\",\"\",'Incident Log'!C10)","v":"Alert Type"},"Alert Type 1","Count","Rank","Priority","Alert Type Final","Count 2"]
[{"$f":"IF('Incident Log'!C11=\"\",\"Blank\",'Incident Log'!C11)","v":"Blank"},{"$f":"IFERROR(INDEX($A$11:$A$500, MATCH(0, COUNTIF($B$10:B10, $A$11:$A$500), 0)),\"\")","v":"Blank"},{"$f":"IF(B11=\"\",\"\",COUNTIF('Incident Log'!$C$11:$C$500,B11))","v":0},{"$f":"IF(B11=\"\",\"\",RANK(C11,$C$11:$C$500)+COUNTIF($C$11:C11,C11)-1)","v":1},1,{"$f":"IF(B11=\"\",\"\",INDEX($B$11:$B$500,MATCH(E11,$D$11:$D$500,0)))","v":"Blank"},{"$f":"IF(B11=\"\",\"\",VLOOKUP(F11,$B$11:$C$500,2,FALSE))","v":0}]
[{"$f":"IF('Incident Log'!C12=\"\",\"\",'Incident Log'!C12)","v":""},{"$f":"IFERROR(INDEX($A$11:$A$500, MATCH(0, COUNTIF($B$10:B11, $A$11:$A$500), 0)),\"\")","v":""},{"$f":"IF(B12=\"\",\"\",COUNTIF('Incident Log'!$C$11:$C$500,B12))","v":""},{"$f":"IF(B12=\"\",\"\",RANK(C12,$C$11:$C$500)+COUNTIF($C$11:C12,C12)-1)","v":""},{"$f":"IF(B12=\"\",\"\",1+E11)","v":""},{"$f":"IF(B12=\"\",\"\",INDEX($B$11:$B$500,MATCH(E12,$D$11:$D$500,0)))","v":""},{"$f":"IF(B12=\"\",\"\",VLOOKUP(F12,$B$11:$C$500,2,FALSE))","v":""}]
[{"$f":"IF('Incident Log'!C13=\"\",\"\",'Incident Log'!C13)","v":""},{"$f":"IFERROR(INDEX($A$11:$A$500, MATCH(0, COUNTIF($B$10:B12, $A$11:$A$500), 0)),\"\")","v":""},{"$f":"IF(B13=\"\",\"\",COUNTIF('Incident Log'!$C$11:$C$500,B13))","v":""},{"$f":"IF(B13=\"\",\"\",RANK(C13,$C$11:$C$500)+COUNTIF($C$11:C13,C13)-1)","v":""},{"$f":"IF(B13=\"\",\"\",1+E12)","v":""},"",""]
[{"$f":"IF('Incident Log'!C14=\"\",\"\",'Incident Log'!C14)","v":""},{"$f":"IFERROR(INDEX($A$11:$A$500, MATCH(0, COUNTIF($B$10:B13, $A$11:$A$500), 0)),\"\")","v":""},{"$f":"IF(B14=\"\",\"\",COUNTIF('Incident Log'!$C$11:$C$500,B14))","v":""},{"$f":"IF(B14=\"\",\"\",RANK(C14,$C$11:$C$500)+COUNTIF($C$11:C14,C14)-1)","v":""},{"$f":"IF(B14=\"\",\"\",1+E13)","v":""},"",""]
[{"$f":"IF('Incident Log'!C15=\"\",\"\",'Incident Log'!C15)","v":""},{"$f":"IFERROR(INDEX($A$11:$A$500, MATCH(0, COUNTIF($B$10:B14, $A$11:$A$500), 0)),\"\")","v":""},{"$f":"IF(B15=\"\",\"\",COUNTIF('Incident Log'!$C$11:$C$500,B15))","v":""},{"$f":"IF(B15=\"\",\"\",RANK(C15,$C$11:$C$500)+COUNTIF($C$11:C15,C15)-1)","v":""},"","",""]
[{"$f":"IF('Incident Log'!C16=\"\",\"\",'Incident Log'!C16)","v":""},{"$f":"IFERROR(INDEX($A$11:$A$500, MATCH(0, COUNTIF($B$10:B15, $A$11:$A$500), 0)),\"\")","v":""},{"$f":"IF(B16=\"\",\"\",COUNTIF('Incident Log'!$C$11:$C$500,B16))","v":""},{"$f":"IF(B16=\"\",\"\",RANK(C16,$C$11:$C$500)+COUNTIF($C$11:C16,C16)-1)","v":""},"","",""]
[{"$f":"IF('Incident Log'!C17=\"\",\"\",'Incident Log'!C17)","v":""},{"$f":"IFERROR(INDEX($A$11:$A$500, MATCH(0, COUNTIF($B$10:B16, $A$11:$A$500), 0)),\"\")","v":""},{"$f":"IF(B17=\"\",\"\",COUNTIF('Incident Log'!$C$11:$C$500,B17))","v":""},{"$f":"IF(B17=\"\",\"\",RANK(C17,$C$11:$C$500)+COUNTIF($C$11:C17,C17)-1)","v":""},"","",""]
[{"$f":"IF('Incident Log'!C18=\"\",\"\",'Incident Log'!C18)","v":""},{"$f":"IFERROR(INDEX($A$11:$A$500, MATCH(0, COUNTIF($B$10:B17, $A$11:$A$500), 0)),\"\")","v":""},{"$f":"IF(B18=\"\",\"\",COUNTIF('Incident Log'!$C$11:$C$500,B18))","v":""},{"$f":"IF(B18=\"\",\"\",RANK(C18,$C$11:$C$500)+COUNTIF($C$11:C18,C18)-1)","v":""},"","",""]
[{"$f":"IF('Incident Log'!C19=\"\",\"\",'Incident Log'!C19)","v":""},{"$f":"IFERROR(INDEX($A$11:$A$500, MATCH(0, COUNTIF($B$10:B18, $A$11:$A$500), 0)),\"\")","v":""},{"$f":"IF(B19=\"\",\"\",COUNTIF('Incident Log'!$C$11:$C$500,B19))","v":""},{"$f":"IF(B19=\"\",\"\",RANK(C19,$C$11:$C$500)+COUNTIF($C$11:C19,C19)-1)","v":""},"","",""]
[{"$f":"IF('Incident Log'!C20=\"\",\"\",'Incident Log'!C20)","v":""},{"$f":"IFERROR(INDEX($A$11:$A$500, MATCH(0, COUNTIF($B$10:B19, $A$11:$A$500), 0)),\"\")","v":""},{"$f":"IF(B20=\"\",\"\",COUNTIF('Incident Log'!$C$11:$C$500,B20))","v":""},{"$f":"IF(B20=\"\",\"\",RANK(C20,$C$11:$C$500)+COUNTIF($C$11:C20,C20)-1)","v":""},"","",""]
{"$rows_left_out":481}
{"sheet":"Reference","index":7,"n_rows":70,"n_cols":6,"rows_kept":70,"cut":false,"hidden":true,"merged":[]}
[]
[]
[]
[]
[]
[{"$f":"\"Reference - \"&Input!B14","v":"Reference - SITE & ADDRESS"}]
[]
["Alert Type","Notification Method","Yes/No","Alert Category","Internal/External","Hazard Score"]
["Active Shooter","Direct Call","Yes","Hazmat","Internal",0]
["Act of Terrorism","Email","No","Human","External",1]
["Air Quality Issue","In Person","Not Sure","Natural","Both",2]
["Bomb Threat","News / Media","Unknown","Technological","Other",3]
["Building Move","Radio",null,"Other"]
["Chemical Exposure, External","Other Source"]
["Chemical Exposure, Internal","Text"]
["Chemical Spill","Word of Mouth"]
["Chemical Spill, Large"]
["Child Abduction"]
["Civil Unrest / Protesting"]
["Communication / Telephony Failure"]
{"$rows_left_out":51}
{"sheet":"Template","index":8,"n_rows":6,"n_cols":1,"rows_kept":6,"cut":false,"hidden":true,"merged":[]}
[]
[]
[]
[]
[]
["Template"]